Don't check missing includes

12 jobs for fix_cppchecks in 9 minutes and 16 seconds (queued for 1 second)
Status Job ID Name Coverage
  Test
passed #23698
VS2013
VS2013-32-bit

00:00:51

passed #23697
VS2013
VS2013-64-bit

00:00:55

passed #23696
VS2015
VS2015-32-bit

00:01:06

passed #23695
VS2015
VS2015-64-bit

00:01:18

passed #23689
Linux
clang-c++11

00:03:14

failed #23691
Linux
clang-c++98

00:02:35

failed #23694
Linux
cppcheck

00:00:22

passed #23699
Linux
doc

00:00:08

passed #23688
Linux
gcc-c++11

00:01:59

passed #23690
Linux
gcc-c++98

00:03:10

passed #23692
Apple
macos-c++11

00:01:24

passed #23693
Apple
macos-c++98

00:01:20

 
Name Stage Failure
failed
cppcheck Test There is an unknown failure, please try again

==============================================================================
CPPCHECK Summary
==============================================================================


Total CPPCHECK error Count is 18, which is too High! CPPCHECK Run failed

ERROR: Build failed: exit status 1
failed
clang-c++98 Test There is an unknown failure, please try again
src/Unittests/CMakeFiles/unittests.dir/build.make:158: recipe for target 'src/Unittests/CMakeFiles/unittests.dir/unittests_iterators.cc.o' failed
make[3]: *** [src/Unittests/CMakeFiles/unittests.dir/unittests_iterators.cc.o] Error 1
CMakeFiles/Makefile2:184: recipe for target 'src/Unittests/CMakeFiles/unittests.dir/all' failed
make[2]: *** [src/Unittests/CMakeFiles/unittests.dir/all] Error 2
CMakeFiles/Makefile2:196: recipe for target 'src/Unittests/CMakeFiles/unittests.dir/rule' failed
make[1]: *** [src/Unittests/CMakeFiles/unittests.dir/rule] Error 2
Makefile:188: recipe for target 'unittests' failed
make: *** [unittests] Error 2
ERROR: Build failed: exit status 1