Added googletest 1.8.0

12 jobs from fix_cppchecks in 10 minutes and 14 seconds (queued for 1 second)
Status Job ID Name Coverage
  Test
passed #23686
VS2013
VS2013-32-bit

00:00:54

passed #23685
VS2013
VS2013-64-bit

00:00:55

passed #23684
VS2015
VS2015-32-bit

00:01:14

passed #23683
VS2015
VS2015-64-bit

00:01:20

passed #23677
Linux
clang-c++11

00:03:23

failed #23679
Linux
clang-c++98

00:02:19

failed #23682
Linux
cppcheck

00:00:40

passed #23687
Linux
doc

00:00:18

passed #23676
Linux
gcc-c++11

00:01:53

passed #23678
Linux
gcc-c++98

00:03:10

passed #23680
Apple
macos-c++11

00:01:27

passed #23681
Apple
macos-c++98

00:01:20

 
Name Stage Failure
failed
cppcheck Test There is an unknown failure, please try again

==============================================================================
CPPCHECK Summary
==============================================================================


Total CPPCHECK error Count is 20, which is too High! CPPCHECK Run failed

ERROR: Build failed: exit status 1
failed
clang-c++98 Test There is an unknown failure, please try again
src/Unittests/CMakeFiles/unittests.dir/build.make:158: recipe for target 'src/Unittests/CMakeFiles/unittests.dir/unittests_iterators.cc.o' failed
make[3]: *** [src/Unittests/CMakeFiles/unittests.dir/unittests_iterators.cc.o] Error 1
CMakeFiles/Makefile2:184: recipe for target 'src/Unittests/CMakeFiles/unittests.dir/all' failed
make[2]: *** [src/Unittests/CMakeFiles/unittests.dir/all] Error 2
CMakeFiles/Makefile2:196: recipe for target 'src/Unittests/CMakeFiles/unittests.dir/rule' failed
make[1]: *** [src/Unittests/CMakeFiles/unittests.dir/rule] Error 2
Makefile:188: recipe for target 'unittests' failed
make: *** [unittests] Error 2
ERROR: Build failed: exit status 1