Revert some explicits

12 jobs from fix_cppchecks in 1 minute and 50 seconds
Status Job ID Name Coverage
  Test
canceled #23674
VS2013
VS2013-32-bit

canceled #23673
VS2013
VS2013-64-bit

canceled #23672
VS2015
VS2015-32-bit

canceled #23671
VS2015
VS2015-64-bit

canceled #23665
Linux
clang-c++11

00:01:33

canceled #23667
Linux
clang-c++98

00:01:07

failed #23670
Linux
cppcheck

00:00:22

passed #23675
Linux
doc

00:00:08

canceled #23664
Linux
gcc-c++11

00:01:38

failed #23666
Linux
gcc-c++98

00:01:03

canceled #23668
Apple
macos-c++11

canceled #23669
Apple
macos-c++98

 
Name Stage Failure
failed
cppcheck Test There is an unknown failure, please try again

==============================================================================
CPPCHECK Summary
==============================================================================


Total CPPCHECK error Count is 20, which is too High! CPPCHECK Run failed

ERROR: Build failed: exit status 1
failed
gcc-c++98 Test There is an unknown failure, please try again
/usr/bin/ld: final link failed: Nonrepresentable section on output
collect2: error: ld returned 1 exit status
src/Unittests/CMakeFiles/unittests.dir/build.make:253: recipe for target 'Unittests/unittests' failed
make[2]: *** [Unittests/unittests] Error 1
CMakeFiles/Makefile2:184: recipe for target 'src/Unittests/CMakeFiles/unittests.dir/all' failed
make[1]: *** [src/Unittests/CMakeFiles/unittests.dir/all] Error 2
Makefile:127: recipe for target 'all' failed
make: *** [all] Error 2
ERROR: Build failed: exit status 1