Revert the bigger explicit parts

12 jobs for fix_cppchecks in 2 minutes and 23 seconds (queued for 1 second)
Status Job ID Name Coverage
  Test
canceled #23652
VS2013
VS2013-32-bit

canceled #23651
VS2013
VS2013-64-bit

canceled #23650
VS2015
VS2015-32-bit

canceled #23649
VS2015
VS2015-64-bit

failed #23643
Linux
clang-c++11

00:01:04

failed #23645
Linux
clang-c++98

00:01:34

failed #23648
Linux
cppcheck

00:00:40

passed #23653
Linux
doc

00:00:16

failed #23642
Linux
gcc-c++11

00:02:21

failed #23644
Linux
gcc-c++98

00:01:54

canceled #23646
Apple
macos-c++11

canceled #23647
Apple
macos-c++98

 
Name Stage Failure
failed
cppcheck Test There is an unknown failure, please try again

==============================================================================
CPPCHECK Summary
==============================================================================


Total CPPCHECK error Count is 13, which is too High! CPPCHECK Run failed

ERROR: Build failed: exit status 1
failed
clang-c++98 Test There is an unknown failure, please try again
/home/gitlab-runner/sw/gtest-1.7.0/include/gtest/gtest.h:1456: undefined reference to `testing::internal::EqFailure(char const*, char const*, std::__cxx11::basic_string<char, std::char_traits<char>, std::allocator<char> > const&, std::__cxx11::basic_string<char, std::char_traits<char>, std::allocator<char> > const&, bool)'
clang: error: linker command failed with exit code 1 (use -v to see invocation)
src/Unittests/CMakeFiles/unittests.dir/build.make:253: recipe for target 'Unittests/unittests' failed
make[2]: *** [Unittests/unittests] Error 1
CMakeFiles/Makefile2:184: recipe for target 'src/Unittests/CMakeFiles/unittests.dir/all' failed
make[1]: *** [src/Unittests/CMakeFiles/unittests.dir/all] Error 2
Makefile:127: recipe for target 'all' failed
make: *** [all] Error 2
ERROR: Build failed: exit status 1
failed
gcc-c++98 Test There is an unknown failure, please try again
/usr/bin/ld: final link failed: Nonrepresentable section on output
collect2: error: ld returned 1 exit status
src/Unittests/CMakeFiles/unittests.dir/build.make:253: recipe for target 'Unittests/unittests' failed
make[2]: *** [Unittests/unittests] Error 1
CMakeFiles/Makefile2:184: recipe for target 'src/Unittests/CMakeFiles/unittests.dir/all' failed
make[1]: *** [src/Unittests/CMakeFiles/unittests.dir/all] Error 2
Makefile:127: recipe for target 'all' failed
make: *** [all] Error 2
ERROR: Build failed: exit status 1
failed
clang-c++11 Test There is an unknown failure, please try again
/local/gitlab-runner/sw/gtest-1.7.0/include/gtest/gtest.h:1456: undefined reference to `testing::internal::EqFailure(char const*, char const*, std::__cxx11::basic_string<char, std::char_traits<char>, std::allocator<char> > const&, std::__cxx11::basic_string<char, std::char_traits<char>, std::allocator<char> > const&, bool)'
clang: error: linker command failed with exit code 1 (use -v to see invocation)
src/Unittests/CMakeFiles/unittests.dir/build.make:253: recipe for target 'Unittests/unittests' failed
make[2]: *** [Unittests/unittests] Error 1
CMakeFiles/Makefile2:184: recipe for target 'src/Unittests/CMakeFiles/unittests.dir/all' failed
make[1]: *** [src/Unittests/CMakeFiles/unittests.dir/all] Error 2
Makefile:127: recipe for target 'all' failed
make: *** [all] Error 2
ERROR: Build failed: exit status 1
failed
gcc-c++11 Test There is an unknown failure, please try again
/usr/bin/ld: final link failed: Nonrepresentable section on output
collect2: error: ld returned 1 exit status
src/Unittests/CMakeFiles/unittests.dir/build.make:253: recipe for target 'Unittests/unittests' failed
make[2]: *** [Unittests/unittests] Error 1
CMakeFiles/Makefile2:184: recipe for target 'src/Unittests/CMakeFiles/unittests.dir/all' failed
make[1]: *** [src/Unittests/CMakeFiles/unittests.dir/all] Error 2
Makefile:127: recipe for target 'all' failed
make: *** [all] Error 2
ERROR: Build failed: exit status 1