Add simple test for ptr::make_unique

11 jobs for make_unique in 8 minutes and 5 seconds
Status Job ID Name Coverage
  Test
passed #16456
VS2013
VS2013-32-bit

00:00:53

passed #16455
VS2013
VS2013-64-bit

00:00:55

passed #16454
VS2015
VS2015-32-bit

00:01:06

passed #16453
VS2015
VS2015-64-bit

00:01:10

passed #16447
Linux
clang-c++11

00:02:26

failed #16449
Linux
clang-c++98

00:00:03

passed #16452
Linux
cppcheck

00:01:42

passed #16446
Linux
gcc-c++11

00:03:28

failed #16448
Linux
gcc-c++98

00:00:02

passed #16450
Apple
macos-c++11

00:02:34

passed #16451
Apple
macos-c++98

00:02:21

 
Name Stage Failure
failed
clang-c++98 Test There is an unknown failure, please try again
fatal error: too many errors emitted, stopping now [-ferror-limit=]
1 warning and 20 errors generated.
src/CMakeFiles/OpenVolumeMesh.dir/build.make:62: recipe for target 'src/CMakeFiles/OpenVolumeMesh.dir/OpenVolumeMesh/Attribs/StatusAttrib.cc.o' failed
make[2]: *** [src/CMakeFiles/OpenVolumeMesh.dir/OpenVolumeMesh/Attribs/StatusAttrib.cc.o] Error 1
CMakeFiles/Makefile2:92: recipe for target 'src/CMakeFiles/OpenVolumeMesh.dir/all' failed
make[1]: *** [src/CMakeFiles/OpenVolumeMesh.dir/all] Error 2
Makefile:127: recipe for target 'all' failed
make: *** [all] Error 2
ERROR: Build failed: exit status 1
failed
gcc-c++98 Test There is an unknown failure, please try again
     PropertyPtr<OpenVolumeMeshPropertyT<T>, VertexPropHandle>::get()->deserialize(_istr);
^
src/CMakeFiles/OpenVolumeMesh.dir/build.make:62: recipe for target 'src/CMakeFiles/OpenVolumeMesh.dir/OpenVolumeMesh/Attribs/StatusAttrib.cc.o' failed
make[2]: *** [src/CMakeFiles/OpenVolumeMesh.dir/OpenVolumeMesh/Attribs/StatusAttrib.cc.o] Error 1
CMakeFiles/Makefile2:92: recipe for target 'src/CMakeFiles/OpenVolumeMesh.dir/all' failed
make[1]: *** [src/CMakeFiles/OpenVolumeMesh.dir/all] Error 2
Makefile:127: recipe for target 'all' failed
make: *** [all] Error 2
ERROR: Build failed: exit status 1