Added ci jobs for OpenVolumemesh

6 jobs for v2beta
Status Job ID Name Coverage
  Test
failed #1013
Linux
clang-c++11

00:01:13

failed #1015
Linux
clang-c++98

00:01:02

failed #1012
Linux
gcc-c++11

00:01:51

failed #1014
Linux
gcc-c++98

00:01:25

failed #1016
Apple
macos-c++11

00:00:49

failed #1017
Apple
macos-c++98

00:00:48

 
Name Stage Failure
failed
macos-c++98 Test There is an unknown failure, please try again
Which is: 8
/Users/jenkins/gitlab-runner/builds/8dfb9a4a/0/OpenVolumeMesh/OpenVolumeMesh/src/Unittests/unittests_basics.hh:1240: Failure
Value of: mesh_.n_cells()
Actual: 2
Expected: 1u
Which is: 1
CI/ci-mac.sh: line 46: 49318 Segmentation fault: 11 ./unittests --gtest_color=yes --gtest_output=xml

ERROR: Build failed with: exit status 1
failed
macos-c++11 Test There is an unknown failure, please try again
Which is: 8
/Users/jenkins/gitlab-runner/builds/8dfb9a4a/0/OpenVolumeMesh/OpenVolumeMesh/src/Unittests/unittests_basics.hh:1240: Failure
Value of: mesh_.n_cells()
Actual: 2
Expected: 1u
Which is: 1
CI/ci-mac.sh: line 46: 42800 Segmentation fault: 11 ./unittests --gtest_color=yes --gtest_output=xml

ERROR: Build failed with: exit status 1
failed
clang-c++98 Test There is an unknown failure, please try again
[  FAILED  ] PolyhedralMeshBase.DeleteFaceBUTest1
[ FAILED ] PolyhedralMeshBase.DeleteEdgeBUTest1
[ FAILED ] PolyhedralMeshBase.DeleteFaceBUTest1noBU
[ FAILED ] PolyhedralMeshBase.DeleteEdgeBUTest1noBU
[ FAILED ] HexahedralMeshBase.BottomUpIncidenceUpdate1

5 FAILED TESTS

ERROR: Build failed with: exit status 1
failed
gcc-c++98 Test There is an unknown failure, please try again
[  FAILED  ] PolyhedralMeshBase.DeleteFaceBUTest1
[ FAILED ] PolyhedralMeshBase.DeleteEdgeBUTest1
[ FAILED ] PolyhedralMeshBase.DeleteFaceBUTest1noBU
[ FAILED ] PolyhedralMeshBase.DeleteEdgeBUTest1noBU
[ FAILED ] HexahedralMeshBase.BottomUpIncidenceUpdate1

5 FAILED TESTS

ERROR: Build failed with: exit status 1
failed
clang-c++11 Test There is an unknown failure, please try again
[  FAILED  ] PolyhedralMeshBase.DeleteFaceBUTest1
[ FAILED ] PolyhedralMeshBase.DeleteEdgeBUTest1
[ FAILED ] PolyhedralMeshBase.DeleteFaceBUTest1noBU
[ FAILED ] PolyhedralMeshBase.DeleteEdgeBUTest1noBU
[ FAILED ] HexahedralMeshBase.BottomUpIncidenceUpdate1

5 FAILED TESTS

ERROR: Build failed with: exit status 1
failed
gcc-c++11 Test There is an unknown failure, please try again
[  FAILED  ] PolyhedralMeshBase.DeleteFaceBUTest1
[ FAILED ] PolyhedralMeshBase.DeleteEdgeBUTest1
[ FAILED ] PolyhedralMeshBase.DeleteFaceBUTest1noBU
[ FAILED ] PolyhedralMeshBase.DeleteEdgeBUTest1noBU
[ FAILED ] HexahedralMeshBase.BottomUpIncidenceUpdate1

5 FAILED TESTS

ERROR: Build failed with: exit status 1