Wrong fiel

11 jobs for make_unique in 3 minutes and 42 seconds
Status Job ID Name Coverage
  Test
passed #17112
VS2013
VS2013-32-bit

00:00:52

passed #17111
VS2013
VS2013-64-bit

00:00:56

passed #17110
VS2015
VS2015-32-bit

00:01:02

passed #17109
VS2015
VS2015-64-bit

00:01:08

passed #17103
Linux
clang-c++11

00:02:25

failed #17105
Linux
clang-c++98

00:00:33

passed #17108
Linux
cppcheck

00:01:44

passed #17102
Linux
gcc-c++11

00:03:42

failed #17104
Linux
gcc-c++98

00:00:37

passed #17106
Apple
macos-c++11

00:02:28

failed #17107
Apple
macos-c++98

00:01:27

 
Name Stage Failure
failed
macos-c++98 Test There is an unknown failure, please try again
/Users/jenkins/sw/gtest-1.7.0/include/gtest/gtest_pred_impl.h:147:28: note: expanded from macro 'GTEST_PRED_FORMAT2_'
GTEST_ASSERT_(pred_format(#v1, #v2, v1, v2), \
^
1 warning and 4 errors generated.
make[2]: *** [src/Unittests/CMakeFiles/unittests.dir/unittests_smartptr.cc.o] Error 1
make[1]: *** [src/Unittests/CMakeFiles/unittests.dir/all] Error 2
make: *** [all] Error 2

ERROR: Build failed: exit status 1
failed
clang-c++98 Test There is an unknown failure, please try again
                                                   ^
1 warning and 12 errors generated.
src/Unittests/CMakeFiles/unittests.dir/build.make:62: recipe for target 'src/Unittests/CMakeFiles/unittests.dir/unittests_smartptr.cc.o' failed
make[2]: *** [src/Unittests/CMakeFiles/unittests.dir/unittests_smartptr.cc.o] Error 1
CMakeFiles/Makefile2:184: recipe for target 'src/Unittests/CMakeFiles/unittests.dir/all' failed
make[1]: *** [src/Unittests/CMakeFiles/unittests.dir/all] Error 2
Makefile:127: recipe for target 'all' failed
make: *** [all] Error 2
ERROR: Build failed: exit status 1
failed
gcc-c++98 Test There is an unknown failure, please try again
   EXPECT_EQ(bar.get(), nullptr);
^
src/Unittests/CMakeFiles/unittests.dir/build.make:62: recipe for target 'src/Unittests/CMakeFiles/unittests.dir/unittests_smartptr.cc.o' failed
make[2]: *** [src/Unittests/CMakeFiles/unittests.dir/unittests_smartptr.cc.o] Error 1
CMakeFiles/Makefile2:184: recipe for target 'src/Unittests/CMakeFiles/unittests.dir/all' failed
make[1]: *** [src/Unittests/CMakeFiles/unittests.dir/all] Error 2
Makefile:127: recipe for target 'all' failed
make: *** [all] Error 2
ERROR: Build failed: exit status 1