add missing header

7 jobs for master in 3 minutes and 43 seconds
Status Job ID Name Coverage
  Test
passed #13713
Linux
clang-c++11

00:02:02

failed #13715
Linux
clang-c++98

00:00:03

passed #13718
Linux
cppcheck

00:01:33

passed #13712
Linux
gcc-c++11

00:03:22

failed #13714
Linux
gcc-c++98

00:00:02

passed #13716
Apple
macos-c++11

00:02:28

passed #13717
Apple
macos-c++98

00:02:17

 
Name Stage Failure
failed
clang-c++98 Test There is an unknown failure, please try again
                                                                                                      ^
16 errors generated.
src/CMakeFiles/OpenVolumeMesh.dir/build.make:86: recipe for target 'src/CMakeFiles/OpenVolumeMesh.dir/OpenVolumeMesh/Attribs/StatusAttrib.cc.o' failed
make[2]: *** [src/CMakeFiles/OpenVolumeMesh.dir/OpenVolumeMesh/Attribs/StatusAttrib.cc.o] Error 1
CMakeFiles/Makefile2:92: recipe for target 'src/CMakeFiles/OpenVolumeMesh.dir/all' failed
make[1]: *** [src/CMakeFiles/OpenVolumeMesh.dir/all] Error 2
Makefile:127: recipe for target 'all' failed
make: *** [all] Error 2
ERROR: Build failed: exit status 1
failed
gcc-c++98 Test There is an unknown failure, please try again
   template<class U> static false_type test(...);
^
src/CMakeFiles/OpenVolumeMesh.dir/build.make:86: recipe for target 'src/CMakeFiles/OpenVolumeMesh.dir/OpenVolumeMesh/Attribs/StatusAttrib.cc.o' failed
make[2]: *** [src/CMakeFiles/OpenVolumeMesh.dir/OpenVolumeMesh/Attribs/StatusAttrib.cc.o] Error 1
CMakeFiles/Makefile2:92: recipe for target 'src/CMakeFiles/OpenVolumeMesh.dir/all' failed
make[1]: *** [src/CMakeFiles/OpenVolumeMesh.dir/all] Error 2
Makefile:127: recipe for target 'all' failed
make: *** [all] Error 2
ERROR: Build failed: exit status 1