Merge branch 'mheistermann/OpenVolumeMesh-range-for'

7 jobs for master in 3 minutes and 21 seconds
Status Job ID Name Coverage
  Test
passed #13693
Linux
clang-c++11

00:02:17

failed #13695
Linux
clang-c++98

00:00:03

passed #13698
Linux
cppcheck

00:01:28

passed #13692
Linux
gcc-c++11

00:03:21

failed #13694
Linux
gcc-c++98

00:00:03

passed #13696
Apple
macos-c++11

00:02:23

passed #13697
Apple
macos-c++98

00:02:22

 
Name Stage Failure
failed
clang-c++98 Test There is an unknown failure, please try again
                                                                                                      ^
16 errors generated.
src/CMakeFiles/OpenVolumeMesh.dir/build.make:86: recipe for target 'src/CMakeFiles/OpenVolumeMesh.dir/OpenVolumeMesh/Attribs/StatusAttrib.cc.o' failed
make[2]: *** [src/CMakeFiles/OpenVolumeMesh.dir/OpenVolumeMesh/Attribs/StatusAttrib.cc.o] Error 1
CMakeFiles/Makefile2:92: recipe for target 'src/CMakeFiles/OpenVolumeMesh.dir/all' failed
make[1]: *** [src/CMakeFiles/OpenVolumeMesh.dir/all] Error 2
Makefile:127: recipe for target 'all' failed
make: *** [all] Error 2
ERROR: Build failed: exit status 1
failed
gcc-c++98 Test There is an unknown failure, please try again
   template<class U> static false_type test(...);
^
src/CMakeFiles/OpenVolumeMesh.dir/build.make:86: recipe for target 'src/CMakeFiles/OpenVolumeMesh.dir/OpenVolumeMesh/Attribs/StatusAttrib.cc.o' failed
make[2]: *** [src/CMakeFiles/OpenVolumeMesh.dir/OpenVolumeMesh/Attribs/StatusAttrib.cc.o] Error 1
CMakeFiles/Makefile2:92: recipe for target 'src/CMakeFiles/OpenVolumeMesh.dir/all' failed
make[1]: *** [src/CMakeFiles/OpenVolumeMesh.dir/all] Error 2
Makefile:127: recipe for target 'all' failed
make: *** [all] Error 2
ERROR: Build failed: exit status 1