fix unittests

6 jobs for v2beta
Status Job ID Name Coverage
  Test
failed #1202
Linux
clang-c++11

00:01:50

failed #1204
Linux
clang-c++98

00:01:44

failed #1201
Linux
gcc-c++11

00:02:41

failed #1203
Linux
gcc-c++98

00:02:05

failed #1205
Apple
macos-c++11

00:01:11

failed #1206
Apple
macos-c++98

00:01:06

 
Name Stage Failure
failed
macos-c++98 Test There is an unknown failure, please try again
  "OpenVolumeMesh::has_output_operator<std::__1::basic_ostream<char, std::__1::char_traits<char> >, OpenVolumeMesh::OpenVolumeMeshStatus>::value", referenced from:
std::__1::basic_ostream<char, std::__1::char_traits<char> >& OpenVolumeMesh::serialize<OpenVolumeMesh::OpenVolumeMeshStatus>(std::__1::basic_ostream<char, std::__1::char_traits<char> >&, OpenVolumeMesh::OpenVolumeMeshStatus const&) in StatusAttrib.cc.o
ld: symbol(s) not found for architecture x86_64
clang: error: linker command failed with exit code 1 (use -v to see invocation)
make[2]: *** [src/libOpenVolumeMesh.2.0.dylib] Error 1
make[1]: *** [src/CMakeFiles/OpenVolumeMesh.dir/all] Error 2
make: *** [all] Error 2

ERROR: Build failed with: exit status 1
failed
macos-c++11 Test There is an unknown failure, please try again
  "OpenVolumeMesh::has_output_operator<std::__1::basic_ostream<char, std::__1::char_traits<char> >, OpenVolumeMesh::OpenVolumeMeshStatus>::value", referenced from:
std::__1::basic_ostream<char, std::__1::char_traits<char> >& OpenVolumeMesh::serialize<OpenVolumeMesh::OpenVolumeMeshStatus>(std::__1::basic_ostream<char, std::__1::char_traits<char> >&, OpenVolumeMesh::OpenVolumeMeshStatus const&) in StatusAttrib.cc.o
ld: symbol(s) not found for architecture x86_64
clang: error: linker command failed with exit code 1 (use -v to see invocation)
make[2]: *** [src/libOpenVolumeMesh.2.0.dylib] Error 1
make[1]: *** [src/CMakeFiles/OpenVolumeMesh.dir/all] Error 2
make: *** [all] Error 2

ERROR: Build failed with: exit status 1
failed
clang-c++98 Test There is an unknown failure, please try again
make[3]: *** [Unittests/unittests] Error 1
CMakeFiles/Makefile2:167: recipe for target 'src/Unittests/CMakeFiles/unittests.dir/all' failed
make[2]: *** [src/Unittests/CMakeFiles/unittests.dir/all] Error 2
CMakeFiles/Makefile2:179: recipe for target 'src/Unittests/CMakeFiles/unittests.dir/rule' failed
make[1]: *** [src/Unittests/CMakeFiles/unittests.dir/rule] Error 2
Makefile:177: recipe for target 'unittests' failed
make: *** [unittests] Error 2

ERROR: Build failed with: exit status 1
failed
gcc-c++98 Test There is an unknown failure, please try again
make[3]: *** [Unittests/unittests] Error 1
CMakeFiles/Makefile2:167: recipe for target 'src/Unittests/CMakeFiles/unittests.dir/all' failed
make[2]: *** [src/Unittests/CMakeFiles/unittests.dir/all] Error 2
CMakeFiles/Makefile2:179: recipe for target 'src/Unittests/CMakeFiles/unittests.dir/rule' failed
make[1]: *** [src/Unittests/CMakeFiles/unittests.dir/rule] Error 2
Makefile:177: recipe for target 'unittests' failed
make: *** [unittests] Error 2

ERROR: Build failed with: exit status 1
failed
clang-c++11 Test There is an unknown failure, please try again
make[3]: *** [Unittests/unittests] Error 1
CMakeFiles/Makefile2:167: recipe for target 'src/Unittests/CMakeFiles/unittests.dir/all' failed
make[2]: *** [src/Unittests/CMakeFiles/unittests.dir/all] Error 2
CMakeFiles/Makefile2:179: recipe for target 'src/Unittests/CMakeFiles/unittests.dir/rule' failed
make[1]: *** [src/Unittests/CMakeFiles/unittests.dir/rule] Error 2
Makefile:177: recipe for target 'unittests' failed
make: *** [unittests] Error 2

ERROR: Build failed with: exit status 1
failed
gcc-c++11 Test There is an unknown failure, please try again
make[3]: *** [Unittests/unittests] Error 1
CMakeFiles/Makefile2:167: recipe for target 'src/Unittests/CMakeFiles/unittests.dir/all' failed
make[2]: *** [src/Unittests/CMakeFiles/unittests.dir/all] Error 2
CMakeFiles/Makefile2:179: recipe for target 'src/Unittests/CMakeFiles/unittests.dir/rule' failed
make[1]: *** [src/Unittests/CMakeFiles/unittests.dir/rule] Error 2
Makefile:177: recipe for target 'unittests' failed
make: *** [unittests] Error 2

ERROR: Build failed with: exit status 1