Merge branch 'master' into persistent_edge_properties

29 jobs from persistent_edge_properties in 57 minutes and 28 seconds (queued for 2 seconds)
Status Job ID Name Coverage
  Build
failed #58746
VS2013
VS2013-32-bit-shared-apps

05:05

passed #58747
VS2013
VS2013-32-bit-shared-no-apps

04:56

passed #58750
VS2013
VS2013-32-bit-static-apps

06:15

passed #58751
VS2013
VS2013-32-bit-static-no-apps

05:05

failed #58744
VS2013
VS2013-64-bit-shared-apps

05:39

passed #58745
VS2013
VS2013-64-bit-shared-no-apps

06:03

passed #58748
VS2013
VS2013-64-bit-static-apps

07:08

passed #58749
VS2013
VS2013-64-bit-static-no-apps

05:44

failed #58738
VS2015
VS2015-32-bit-shared-apps

06:42

passed #58739
VS2015
VS2015-32-bit-shared-no-apps

06:57

failed #58742
VS2015
VS2015-32-bit-static-apps

06:37

passed #58743
VS2015
VS2015-32-bit-static-no-apps

07:11

passed #58736
VS2015
VS2015-64-bit-shared-apps

09:11

passed #58737
VS2015
VS2015-64-bit-shared-no-apps

07:39

failed #58740
VS2015
VS2015-64-bit-static-apps

07:56

passed #58741
VS2015
VS2015-64-bit-static-no-apps

08:31

failed #58733
VS2017
VS2017-32-bit-shared-no-apps

00:11

failed #58735
VS2017
VS2017-32-bit-static-no-apps

00:13

failed #58730
Qt5101 VS2017
VS2017-64-bit-shared-apps

00:20

failed #58732
VS2017
VS2017-64-bit-shared-no-apps

00:14

passed #58731
Qt5101 VS2017
VS2017-64-bit-static-apps

08:16

failed #58734
VS2017
VS2017-64-bit-static-no-apps

00:12

passed #58724
Linux
clang-c++11

19:12

passed #58726
Linux
clang-c++14

39:16

passed #58729
Linux
cppcheck

00:08

passed #58723
Linux
gcc-c++11

04:23

passed #58725
Linux
gcc-c++14

04:15

passed #58727
Apple
macos-c++11

24:07

passed #58728
Apple
macos-c++98

13:21

 
Name Stage Failure
failed
VS2013-32-bit-shared-apps Build
4>C:\Program Files (x86)\MSBuild\Microsoft.Cpp\v4.0\V120\Microsoft.CppCommon.targets(132,5): error MSB3073: :cmDone
4>C:\Program Files (x86)\MSBuild\Microsoft.Cpp\v4.0\V120\Microsoft.CppCommon.targets(132,5): error MSB3073: if %errorlevel% neq 0 goto :VCEnd
4>C:\Program Files (x86)\MSBuild\Microsoft.Cpp\v4.0\V120\Microsoft.CppCommon.targets(132,5): error MSB3073: :VCEnd" exited with code 1.
4>
4>Build FAILED.
4>
4>Time Elapsed 00:00:00.31
========== Build: 3 succeeded, 1 failed, 12 up-to-date, 0 skipped ==========
ERROR: Job failed: exit status 1
failed
VS2013-64-bit-shared-apps Build
4>C:\Program Files (x86)\MSBuild\Microsoft.Cpp\v4.0\V120\Microsoft.CppCommon.targets(132,5): error MSB3073: :cmDone
4>C:\Program Files (x86)\MSBuild\Microsoft.Cpp\v4.0\V120\Microsoft.CppCommon.targets(132,5): error MSB3073: if %errorlevel% neq 0 goto :VCEnd
4>C:\Program Files (x86)\MSBuild\Microsoft.Cpp\v4.0\V120\Microsoft.CppCommon.targets(132,5): error MSB3073: :VCEnd" exited with code 1.
4>
4>Build FAILED.
4>
4>Time Elapsed 00:00:00.35
========== Build: 3 succeeded, 1 failed, 12 up-to-date, 0 skipped ==========
ERROR: Job failed: exit status 1
failed
VS2015-32-bit-static-apps Build
4>C:\Program Files (x86)\MSBuild\Microsoft.Cpp\v4.0\V140\Microsoft.CppCommon.targets(133,5): error MSB3073: :cmEnd
4>C:\Program Files (x86)\MSBuild\Microsoft.Cpp\v4.0\V140\Microsoft.CppCommon.targets(133,5): error MSB3073: endlocal & call :cmErrorLevel %errorlevel% & goto :cmDone
4>C:\Program Files (x86)\MSBuild\Microsoft.Cpp\v4.0\V140\Microsoft.CppCommon.targets(133,5): error MSB3073: :cmErrorLevel
4>C:\Program Files (x86)\MSBuild\Microsoft.Cpp\v4.0\V140\Microsoft.CppCommon.targets(133,5): error MSB3073: exit /b %1
4>C:\Program Files (x86)\MSBuild\Microsoft.Cpp\v4.0\V140\Microsoft.CppCommon.targets(133,5): error MSB3073: :cmDone
4>C:\Program Files (x86)\MSBuild\Microsoft.Cpp\v4.0\V140\Microsoft.CppCommon.targets(133,5): error MSB3073: if %errorlevel% neq 0 goto :VCEnd
4>C:\Program Files (x86)\MSBuild\Microsoft.Cpp\v4.0\V140\Microsoft.CppCommon.targets(133,5): error MSB3073: :VCEnd" exited with code 1.
========== Build: 3 succeeded, 1 failed, 12 up-to-date, 0 skipped ==========
ERROR: Job failed: exit status 1
failed
VS2015-64-bit-static-apps Build
4>C:\Program Files (x86)\MSBuild\Microsoft.Cpp\v4.0\V140\Microsoft.CppCommon.targets(133,5): error MSB3073: :cmEnd
4>C:\Program Files (x86)\MSBuild\Microsoft.Cpp\v4.0\V140\Microsoft.CppCommon.targets(133,5): error MSB3073: endlocal & call :cmErrorLevel %errorlevel% & goto :cmDone
4>C:\Program Files (x86)\MSBuild\Microsoft.Cpp\v4.0\V140\Microsoft.CppCommon.targets(133,5): error MSB3073: :cmErrorLevel
4>C:\Program Files (x86)\MSBuild\Microsoft.Cpp\v4.0\V140\Microsoft.CppCommon.targets(133,5): error MSB3073: exit /b %1
4>C:\Program Files (x86)\MSBuild\Microsoft.Cpp\v4.0\V140\Microsoft.CppCommon.targets(133,5): error MSB3073: :cmDone
4>C:\Program Files (x86)\MSBuild\Microsoft.Cpp\v4.0\V140\Microsoft.CppCommon.targets(133,5): error MSB3073: if %errorlevel% neq 0 goto :VCEnd
4>C:\Program Files (x86)\MSBuild\Microsoft.Cpp\v4.0\V140\Microsoft.CppCommon.targets(133,5): error MSB3073: :VCEnd" exited with code 1.
========== Build: 3 succeeded, 1 failed, 12 up-to-date, 0 skipped ==========
ERROR: Job failed: exit status 1
failed
VS2015-32-bit-shared-apps Build
4>C:\Program Files (x86)\MSBuild\Microsoft.Cpp\v4.0\V140\Microsoft.CppCommon.targets(133,5): error MSB3073: :cmEnd
4>C:\Program Files (x86)\MSBuild\Microsoft.Cpp\v4.0\V140\Microsoft.CppCommon.targets(133,5): error MSB3073: endlocal & call :cmErrorLevel %errorlevel% & goto :cmDone
4>C:\Program Files (x86)\MSBuild\Microsoft.Cpp\v4.0\V140\Microsoft.CppCommon.targets(133,5): error MSB3073: :cmErrorLevel
4>C:\Program Files (x86)\MSBuild\Microsoft.Cpp\v4.0\V140\Microsoft.CppCommon.targets(133,5): error MSB3073: exit /b %1
4>C:\Program Files (x86)\MSBuild\Microsoft.Cpp\v4.0\V140\Microsoft.CppCommon.targets(133,5): error MSB3073: :cmDone
4>C:\Program Files (x86)\MSBuild\Microsoft.Cpp\v4.0\V140\Microsoft.CppCommon.targets(133,5): error MSB3073: if %errorlevel% neq 0 goto :VCEnd
4>C:\Program Files (x86)\MSBuild\Microsoft.Cpp\v4.0\V140\Microsoft.CppCommon.targets(133,5): error MSB3073: :VCEnd" exited with code 1.
========== Build: 3 succeeded, 1 failed, 12 up-to-date, 0 skipped ==========
ERROR: Job failed: exit status 1
failed
VS2017-32-bit-static-no-apps Build
		TargetDisplayName(optional)
/TfsLink Opens Team Explorer and launches a viewer for the
provided artifact URI if one is registered.
/useenv Use PATH, INCLUDE, LIBPATH, and LIB environment variables
instead of IDE paths for VC++ builds.

To attach the debugger from the command line, use:
VsJITDebugger.exe -p <pid>
ERROR: Job failed: exit status 1
failed
VS2017-64-bit-static-no-apps Build
		TargetDisplayName(optional)
/TfsLink Opens Team Explorer and launches a viewer for the
provided artifact URI if one is registered.
/useenv Use PATH, INCLUDE, LIBPATH, and LIB environment variables
instead of IDE paths for VC++ builds.

To attach the debugger from the command line, use:
VsJITDebugger.exe -p <pid>
ERROR: Job failed: exit status 1
failed
VS2017-32-bit-shared-no-apps Build
		TargetDisplayName(optional)
/TfsLink Opens Team Explorer and launches a viewer for the
provided artifact URI if one is registered.
/useenv Use PATH, INCLUDE, LIBPATH, and LIB environment variables
instead of IDE paths for VC++ builds.

To attach the debugger from the command line, use:
VsJITDebugger.exe -p <pid>
ERROR: Job failed: exit status 1
failed
VS2017-64-bit-shared-no-apps Build
		TargetDisplayName(optional)
/TfsLink Opens Team Explorer and launches a viewer for the
provided artifact URI if one is registered.
/useenv Use PATH, INCLUDE, LIBPATH, and LIB environment variables
instead of IDE paths for VC++ builds.

To attach the debugger from the command line, use:
VsJITDebugger.exe -p <pid>
ERROR: Job failed: exit status 1
failed
VS2017-64-bit-shared-apps Build
		TargetDisplayName(optional)
/TfsLink Opens Team Explorer and launches a viewer for the
provided artifact URI if one is registered.
/useenv Use PATH, INCLUDE, LIBPATH, and LIB environment variables
instead of IDE paths for VC++ builds.

To attach the debugger from the command line, use:
VsJITDebugger.exe -p <pid>
ERROR: Job failed: exit status 1