fix copy paste bugs for status writing

29 jobs from persistent_edge_properties in 66 minutes and 2 seconds (queued for 2 seconds)
Status Job ID Name Coverage
  Build
passed #58717
VS2013
VS2013-32-bit-shared-apps

06:17

passed #58718
VS2013
VS2013-32-bit-shared-no-apps

04:55

passed #58721
VS2013
VS2013-32-bit-static-apps

06:25

passed #58722
VS2013
VS2013-32-bit-static-no-apps

05:05

failed #58715
VS2013
VS2013-64-bit-shared-apps

05:40

passed #58716
VS2013
VS2013-64-bit-shared-no-apps

05:30

passed #58719
VS2013
VS2013-64-bit-static-apps

07:16

passed #58720
VS2013
VS2013-64-bit-static-no-apps

05:45

passed #58709
VS2015
VS2015-32-bit-shared-apps

07:51

passed #58710
VS2015
VS2015-32-bit-shared-no-apps

06:26

failed #58713
VS2015
VS2015-32-bit-static-apps

06:35

passed #58714
VS2015
VS2015-32-bit-static-no-apps

07:10

passed #58707
VS2015
VS2015-64-bit-shared-apps

09:11

passed #58708
VS2015
VS2015-64-bit-shared-no-apps

07:38

passed #58711
VS2015
VS2015-64-bit-static-apps

09:46

passed #58712
VS2015
VS2015-64-bit-static-no-apps

08:34

failed #58704
VS2017
VS2017-32-bit-shared-no-apps

00:13

failed #58706
VS2017
VS2017-32-bit-static-no-apps

00:15

passed #58701
Qt5101 VS2017
VS2017-64-bit-shared-apps

08:08

passed #58703
VS2017
VS2017-64-bit-shared-no-apps

08:03

passed #58702
Qt5101 VS2017
VS2017-64-bit-static-apps

08:14

passed #58705
VS2017
VS2017-64-bit-static-no-apps

08:18

passed #58695
Linux
clang-c++11

37:37

passed #58697
Linux
clang-c++14

24:50

failed #58700
Linux
cppcheck

00:13

passed #58694
Linux
gcc-c++11

04:46

passed #58696
Linux
gcc-c++14

08:04

passed #58698
Apple
macos-c++11

24:10

passed #58699
Apple
macos-c++98

13:24

 
Name Stage Failure
failed
VS2013-64-bit-shared-apps Build
4>C:\Program Files (x86)\MSBuild\Microsoft.Cpp\v4.0\V120\Microsoft.CppCommon.targets(132,5): error MSB3073: :cmDone
4>C:\Program Files (x86)\MSBuild\Microsoft.Cpp\v4.0\V120\Microsoft.CppCommon.targets(132,5): error MSB3073: if %errorlevel% neq 0 goto :VCEnd
4>C:\Program Files (x86)\MSBuild\Microsoft.Cpp\v4.0\V120\Microsoft.CppCommon.targets(132,5): error MSB3073: :VCEnd" exited with code 1.
4>
4>Build FAILED.
4>
4>Time Elapsed 00:00:00.32
========== Build: 3 succeeded, 1 failed, 12 up-to-date, 0 skipped ==========
ERROR: Job failed: exit status 1
failed
VS2015-32-bit-static-apps Build
4>C:\Program Files (x86)\MSBuild\Microsoft.Cpp\v4.0\V140\Microsoft.CppCommon.targets(133,5): error MSB3073: :cmEnd
4>C:\Program Files (x86)\MSBuild\Microsoft.Cpp\v4.0\V140\Microsoft.CppCommon.targets(133,5): error MSB3073: endlocal & call :cmErrorLevel %errorlevel% & goto :cmDone
4>C:\Program Files (x86)\MSBuild\Microsoft.Cpp\v4.0\V140\Microsoft.CppCommon.targets(133,5): error MSB3073: :cmErrorLevel
4>C:\Program Files (x86)\MSBuild\Microsoft.Cpp\v4.0\V140\Microsoft.CppCommon.targets(133,5): error MSB3073: exit /b %1
4>C:\Program Files (x86)\MSBuild\Microsoft.Cpp\v4.0\V140\Microsoft.CppCommon.targets(133,5): error MSB3073: :cmDone
4>C:\Program Files (x86)\MSBuild\Microsoft.Cpp\v4.0\V140\Microsoft.CppCommon.targets(133,5): error MSB3073: if %errorlevel% neq 0 goto :VCEnd
4>C:\Program Files (x86)\MSBuild\Microsoft.Cpp\v4.0\V140\Microsoft.CppCommon.targets(133,5): error MSB3073: :VCEnd" exited with code 1.
========== Build: 3 succeeded, 1 failed, 12 up-to-date, 0 skipped ==========
ERROR: Job failed: exit status 1
failed
VS2017-32-bit-static-no-apps Build
		TargetDisplayName(optional)
/TfsLink Opens Team Explorer and launches a viewer for the
provided artifact URI if one is registered.
/useenv Use PATH, INCLUDE, LIBPATH, and LIB environment variables
instead of IDE paths for VC++ builds.

To attach the debugger from the command line, use:
VsJITDebugger.exe -p <pid>
ERROR: Job failed: exit status 1
failed
VS2017-32-bit-shared-no-apps Build
		TargetDisplayName(optional)
/TfsLink Opens Team Explorer and launches a viewer for the
provided artifact URI if one is registered.
/useenv Use PATH, INCLUDE, LIBPATH, and LIB environment variables
instead of IDE paths for VC++ builds.

To attach the debugger from the command line, use:
VsJITDebugger.exe -p <pid>
ERROR: Job failed: exit status 1
failed
cppcheck Build

==============================================================================
CPPCHECK Summary
==============================================================================


Total CPPCHECK error Count is 2, which is too High (max is 0)! CPPCHECK Run failed

ERROR: Job failed: exit status 1