Merge branch 'featureSplitCopyInternal' into 'master'

Feature split copy internal

Closes #44

See merge request !137
24 jobs from master in 53 minutes 41 seconds (queued for 1 second)
Status Job ID Name Coverage
  Test
passed #31332
Linux
Doc-publish

00:23

passed #31326
VS2013
VS2013-32-bit-shared-apps

05:08

passed #31327
VS2013
VS2013-32-bit-shared-no-apps

03:38

passed #31330
VS2013
VS2013-32-bit-static-apps

05:04

passed #31331
VS2013
VS2013-32-bit-static-no-apps

03:45

passed #31324
VS2013
VS2013-64-bit-shared-apps

05:12

passed #31325
VS2013
VS2013-64-bit-shared-no-apps

04:09

passed #31328
VS2013
VS2013-64-bit-static-apps

05:01

passed #31329
VS2013
VS2013-64-bit-static-no-apps

04:08

passed #31318
VS2015
VS2015-32-bit-shared-apps

06:18

passed #31319
VS2015
VS2015-32-bit-shared-no-apps

04:57

passed #31322
VS2015
VS2015-32-bit-static-apps

06:03

passed #31323
VS2015
VS2015-32-bit-static-no-apps

05:03

passed #31316
VS2015
VS2015-64-bit-shared-apps

06:53

passed #31317
VS2015
VS2015-64-bit-shared-no-apps

05:41

passed #31320
VS2015
VS2015-64-bit-static-apps

06:58

passed #31321
VS2015
VS2015-64-bit-static-no-apps

05:51

passed #31310
Linux
clang-c++11

27:48

passed #31312
Linux
clang-c++14

28:36

passed #31315
Linux
cppcheck

02:00

failed #31309
Linux
gcc-c++11

03:07

passed #31311
Linux
gcc-c++14

05:08

passed #31313
Apple
macos-c++11

10:00

passed #31314
Apple
macos-c++98

09:48

 
Test gcc-c++11
make[2]: *** [src/Unittests/CMakeFiles/unittests.dir/unittests_sr_binary.cc.o] Error 1
make[2]: *** Waiting for unfinished jobs....
[ 86%] Building CXX object src/Unittests/CMakeFiles/unittests.dir/unittests_trimesh_circulator_face_edge.cc.o
[ 86%] Built target SubdividerGui
CMakeFiles/Makefile2:1088: recipe for target 'src/Unittests/CMakeFiles/unittests.dir/all' failed
make[1]: *** [src/Unittests/CMakeFiles/unittests.dir/all] Error 2
Makefile:149: recipe for target 'all' failed
make: *** [all] Error 2
ERROR: Job failed: exit status 1