C++11: Fixed OpenMesh Python bindings.

6 jobs for cpp11
Status Job ID Name Coverage
  Test
passed #174
Linux
clang-c++11

00:11:59

failed #176
Linux
clang-c++98

00:04:17

passed #173
Linux
gcc-c++11

00:18:38

failed #175
Linux
gcc-c++98

00:09:17

passed #177
Apple
macos-c++11

00:06:11

failed #178
Apple
macos-c++98

00:05:25

 
Name Stage Failure
failed
clang-c++98 Test There is an unknown failure, please try again
CMakeFiles/Makefile2:995: recipe for target 'src/Unittests/CMakeFiles/unittests.dir/all' failed
make[2]: *** [src/Unittests/CMakeFiles/unittests.dir/all] Error 2
CMakeFiles/Makefile2:1007: recipe for target 'src/Unittests/CMakeFiles/unittests.dir/rule' failed
make[1]: *** [src/Unittests/CMakeFiles/unittests.dir/rule] Error 2
Makefile:405: recipe for target 'unittests' failed
make: *** [unittests] Error 2
CI/ci-linux.sh: line 82: ./unittests: No such file or directory

ERROR: Build failed with: exit status 1
failed
gcc-c++98 Test There is an unknown failure, please try again
CMakeFiles/Makefile2:995: recipe for target 'src/Unittests/CMakeFiles/unittests.dir/all' failed
make[2]: *** [src/Unittests/CMakeFiles/unittests.dir/all] Error 2
CMakeFiles/Makefile2:1007: recipe for target 'src/Unittests/CMakeFiles/unittests.dir/rule' failed
make[1]: *** [src/Unittests/CMakeFiles/unittests.dir/rule] Error 2
Makefile:405: recipe for target 'unittests' failed
make: *** [unittests] Error 2
CI/ci-linux.sh: line 82: ./unittests: No such file or directory

ERROR: Build failed with: exit status 1
failed
macos-c++98 Test There is an unknown failure, please try again
[----------] Global test environment tear-down
[==========] 166 tests from 46 test cases ran. (13174 ms total)
[ PASSED ] 165 tests.
[ FAILED ] 1 test, listed below:
[ FAILED ] OpenMeshVectorTest.move_constructor_assignment

1 FAILED TEST

ERROR: Build failed with: exit status 1