more unittests

Status Job ID Name Coverage
  Test
canceled #26474
VS2013
VS2013-32-bit-shared-apps

canceled #26475
VS2013
VS2013-32-bit-shared-no-apps

canceled #26478
VS2013
VS2013-32-bit-static-apps

failed #26479
VS2013
VS2013-32-bit-static-no-apps

01:22

canceled #26472
VS2013
VS2013-64-bit-shared-apps

canceled #26473
VS2013
VS2013-64-bit-shared-no-apps

canceled #26476
VS2013
VS2013-64-bit-static-apps

canceled #26477
VS2013
VS2013-64-bit-static-no-apps

canceled #26466
VS2015
VS2015-32-bit-shared-apps

canceled #26467
VS2015
VS2015-32-bit-shared-no-apps

canceled #26470
VS2015
VS2015-32-bit-static-apps

canceled #26471
VS2015
VS2015-32-bit-static-no-apps

canceled #26464
VS2015
VS2015-64-bit-shared-apps

00:03

canceled #26465
VS2015
VS2015-64-bit-shared-no-apps

canceled #26468
VS2015
VS2015-64-bit-static-apps

canceled #26469
VS2015
VS2015-64-bit-static-no-apps

canceled #26458
Linux
clang-c++11

01:23

canceled #26460
Linux
clang-c++98

00:47

failed #26463
Linux
cppcheck

01:13

failed #26457
Linux
gcc-c++11

00:36

failed #26459
Linux
gcc-c++98

00:53

canceled #26461
Apple
macos-c++11

canceled #26462
Apple
macos-c++98

 
5>CustomBuild:
5> Building Custom Rule E:/gitlab/builds/281b716d/0/OpenMesh/OpenMesh/CMakeLists.txt
5> CMake does not need to re-run because E:\gitlab\builds\281b716d\0\OpenMesh\OpenMesh\build-release\CMakeFiles\generate.stamp is up-to-date.
5>
5>Build succeeded.
5>
5>Time Elapsed 00:00:00.06
========== Build: 4 succeeded, 1 failed, 0 up-to-date, 0 skipped ==========
ERROR: Build failed: exit status 1
Test cppcheck

==============================================================================
CPPCHECK Summary
==============================================================================


Total CPPCHECK error Count is 24, which is too High! CPPCHECK Run failed

ERROR: Job failed: exit status 1
Test gcc-c++98
[ 75%] Built target ProgViewer
CMakeFiles/Makefile2:1088: recipe for target 'src/Unittests/CMakeFiles/unittests.dir/all' failed
make[1]: *** [src/Unittests/CMakeFiles/unittests.dir/all] Error 2
make[1]: *** Waiting for unfinished jobs....
[ 76%] Linking CXX executable ../../../../../Build/bin/SubdividerGui
[ 76%] Built target SubdividerGui
Makefile:149: recipe for target 'all' failed
make: *** [all] Error 2
ERROR: Job failed: exit status 1
Test gcc-c++11
[ 77%] Built target SubdividerGui
CMakeFiles/Makefile2:1088: recipe for target 'src/Unittests/CMakeFiles/unittests.dir/all' failed
make[1]: *** [src/Unittests/CMakeFiles/unittests.dir/all] Error 2
make[1]: *** Waiting for unfinished jobs....
[ 77%] Linking CXX executable ../../../../../Build/bin/DecimaterGui
[ 77%] Built target DecimaterGui
Makefile:149: recipe for target 'all' failed
make: *** [all] Error 2
ERROR: Job failed: exit status 1