unittest for decimater examples

Status Job ID Name Coverage
  Test
passed #26366
VS2013
VS2013-32-bit-shared-apps

05:05

passed #26367
VS2013
VS2013-32-bit-shared-no-apps

03:28

passed #26370
VS2013
VS2013-32-bit-static-apps

04:29

passed #26371
VS2013
VS2013-32-bit-static-no-apps

03:55

passed #26364
VS2013
VS2013-64-bit-shared-apps

05:01

passed #26365
VS2013
VS2013-64-bit-shared-no-apps

04:05

passed #26368
VS2013
VS2013-64-bit-static-apps

04:57

passed #26369
VS2013
VS2013-64-bit-static-no-apps

04:25

passed #26358
VS2015
VS2015-32-bit-shared-apps

06:09

passed #26359
VS2015
VS2015-32-bit-shared-no-apps

05:02

passed #26362
VS2015
VS2015-32-bit-static-apps

05:56

passed #26363
VS2015
VS2015-32-bit-static-no-apps

05:00

passed #26356
VS2015
VS2015-64-bit-shared-apps

07:07

passed #26357
VS2015
VS2015-64-bit-shared-no-apps

05:48

passed #26360
VS2015
VS2015-64-bit-static-apps

06:57

passed #26361
VS2015
VS2015-64-bit-static-no-apps

05:44

failed #26350
Linux
clang-c++11

13:47

failed #26352
Linux
clang-c++98

03:50

failed #26355
Linux
cppcheck

01:09

failed #26349
Linux
gcc-c++11

01:12

failed #26351
Linux
gcc-c++98

01:05

passed #26353
Apple
macos-c++11

10:20

passed #26354
Apple
macos-c++98

09:15

 
Test cppcheck

==============================================================================
CPPCHECK Summary
==============================================================================


Total CPPCHECK error Count is 19, which is too High! CPPCHECK Run failed

ERROR: Job failed: exit status 1
                                                                  ^
1 error generated.
src/Unittests/CMakeFiles/unittests.dir/build.make:422: recipe for target 'src/Unittests/CMakeFiles/unittests.dir/unittests_property.cc.o' failed
make[2]: *** [src/Unittests/CMakeFiles/unittests.dir/unittests_property.cc.o] Error 1
CMakeFiles/Makefile2:1088: recipe for target 'src/Unittests/CMakeFiles/unittests.dir/all' failed
make[1]: *** [src/Unittests/CMakeFiles/unittests.dir/all] Error 2
Makefile:149: recipe for target 'all' failed
make: *** [all] Error 2
ERROR: Job failed: exit status 1
Test gcc-c++98
/usr/bin/ld: final link failed: Nonrepresentable section on output
collect2: error: ld returned 1 exit status
src/Unittests/CMakeFiles/unittests.dir/build.make:1320: recipe for target 'Unittests/unittests' failed
make[2]: *** [Unittests/unittests] Error 1
CMakeFiles/Makefile2:1088: recipe for target 'src/Unittests/CMakeFiles/unittests.dir/all' failed
make[1]: *** [src/Unittests/CMakeFiles/unittests.dir/all] Error 2
Makefile:149: recipe for target 'all' failed
make: *** [all] Error 2
ERROR: Job failed: exit status 1
/local/gitlab-runner/sw/gtest-1.7.0/include/gtest/gtest.h:1456: undefined reference to `testing::internal::EqFailure(char const*, char const*, std::__cxx11::basic_string<char, std::char_traits<char>, std::allocator<char> > const&, std::__cxx11::basic_string<char, std::char_traits<char>, std::allocator<char> > const&, bool)'
clang: error: linker command failed with exit code 1 (use -v to see invocation)
src/Unittests/CMakeFiles/unittests.dir/build.make:1320: recipe for target 'Unittests/unittests' failed
make[2]: *** [Unittests/unittests] Error 1
CMakeFiles/Makefile2:1088: recipe for target 'src/Unittests/CMakeFiles/unittests.dir/all' failed
make[1]: *** [src/Unittests/CMakeFiles/unittests.dir/all] Error 2
Makefile:149: recipe for target 'all' failed
make: *** [all] Error 2
ERROR: Job failed: exit status 1
Test gcc-c++11
/usr/bin/ld: final link failed: Nonrepresentable section on output
collect2: error: ld returned 1 exit status
src/Unittests/CMakeFiles/unittests.dir/build.make:1320: recipe for target 'Unittests/unittests' failed
make[2]: *** [Unittests/unittests] Error 1
CMakeFiles/Makefile2:1088: recipe for target 'src/Unittests/CMakeFiles/unittests.dir/all' failed
make[1]: *** [src/Unittests/CMakeFiles/unittests.dir/all] Error 2
Makefile:149: recipe for target 'all' failed
make: *** [all] Error 2
ERROR: Job failed: exit status 1