fix halfedge indices in OpenMeshTrimeshCirculatorHalfedgeLoop CWAndCCWCheck

23 jobs for fix_HalfedgeLoopCCWIter in 37 minutes and 55 seconds (queued for 1 second)
Status Job ID Name Coverage
  Test
failed #24153
VS2013
VS2013-32-bit-shared-apps

00:04:02

failed #24154
VS2013
VS2013-32-bit-shared-no-apps

00:03:34

failed #24157
VS2013
VS2013-32-bit-static-apps

00:03:59

failed #24158
VS2013
VS2013-32-bit-static-no-apps

00:03:31

failed #24151
VS2013
VS2013-64-bit-shared-apps

00:04:13

failed #24152
VS2013
VS2013-64-bit-shared-no-apps

00:03:51

failed #24155
VS2013
VS2013-64-bit-static-apps

00:04:18

failed #24156
VS2013
VS2013-64-bit-static-no-apps

00:03:51

failed #24145
VS2015
VS2015-32-bit-shared-apps

00:05:52

failed #24146
VS2015
VS2015-32-bit-shared-no-apps

00:04:39

failed #24149
VS2015
VS2015-32-bit-static-apps

00:05:26

failed #24150
VS2015
VS2015-32-bit-static-no-apps

00:04:44

failed #24143
VS2015
VS2015-64-bit-shared-apps

00:06:05

failed #24144
VS2015
VS2015-64-bit-shared-no-apps

00:05:17

failed #24147
VS2015
VS2015-64-bit-static-apps

00:06:21

failed #24148
VS2015
VS2015-64-bit-static-no-apps

00:05:40

failed #24137
Linux
clang-c++11

00:13:52

failed #24139
Linux
clang-c++14

00:07:58

passed #24142
Linux
cppcheck

00:01:58

failed #24136
Linux
gcc-c++11

00:01:23

failed #24138
Linux
gcc-c++14

00:02:24

failed #24140
Apple
macos-c++11

00:04:08

failed #24141
Apple
macos-c++98

00:04:06

 
Name Stage Failure
failed
VS2013-32-bit-static-no-apps Test There is an unknown failure, please try again

[----------] Global test environment tear-down
[==========] 184 tests from 52 test cases ran. (38247 ms total)
[ PASSED ] 183 tests.
[ FAILED ] 1 test, listed below:
[ FAILED ] OpenMeshTrimeshCirculatorHalfedgeLoop.CWAndCCWCheck

1 FAILED TEST
ERROR: Build failed: exit status 1
failed
VS2013-32-bit-static-apps Test There is an unknown failure, please try again

[----------] Global test environment tear-down
[==========] 184 tests from 52 test cases ran. (36817 ms total)
[ PASSED ] 183 tests.
[ FAILED ] 1 test, listed below:
[ FAILED ] OpenMeshTrimeshCirculatorHalfedgeLoop.CWAndCCWCheck

1 FAILED TEST
ERROR: Build failed: exit status 1
failed
VS2013-64-bit-static-no-apps Test There is an unknown failure, please try again

[----------] Global test environment tear-down
[==========] 184 tests from 52 test cases ran. (50645 ms total)
[ PASSED ] 183 tests.
[ FAILED ] 1 test, listed below:
[ FAILED ] OpenMeshTrimeshCirculatorHalfedgeLoop.CWAndCCWCheck

1 FAILED TEST
ERROR: Build failed: exit status 1
failed
VS2013-64-bit-static-apps Test There is an unknown failure, please try again

[----------] Global test environment tear-down
[==========] 184 tests from 52 test cases ran. (49740 ms total)
[ PASSED ] 183 tests.
[ FAILED ] 1 test, listed below:
[ FAILED ] OpenMeshTrimeshCirculatorHalfedgeLoop.CWAndCCWCheck

1 FAILED TEST
ERROR: Build failed: exit status 1
failed
VS2013-32-bit-shared-no-apps Test There is an unknown failure, please try again

[----------] Global test environment tear-down
[==========] 184 tests from 52 test cases ran. (38773 ms total)
[ PASSED ] 183 tests.
[ FAILED ] 1 test, listed below:
[ FAILED ] OpenMeshTrimeshCirculatorHalfedgeLoop.CWAndCCWCheck

1 FAILED TEST
ERROR: Build failed: exit status 1
failed
VS2013-32-bit-shared-apps Test There is an unknown failure, please try again

[----------] Global test environment tear-down
[==========] 184 tests from 52 test cases ran. (37723 ms total)
[ PASSED ] 183 tests.
[ FAILED ] 1 test, listed below:
[ FAILED ] OpenMeshTrimeshCirculatorHalfedgeLoop.CWAndCCWCheck

1 FAILED TEST
ERROR: Build failed: exit status 1
failed
VS2013-64-bit-shared-no-apps Test There is an unknown failure, please try again

[----------] Global test environment tear-down
[==========] 184 tests from 52 test cases ran. (53083 ms total)
[ PASSED ] 183 tests.
[ FAILED ] 1 test, listed below:
[ FAILED ] OpenMeshTrimeshCirculatorHalfedgeLoop.CWAndCCWCheck

1 FAILED TEST
ERROR: Build failed: exit status 1
failed
VS2013-64-bit-shared-apps Test There is an unknown failure, please try again

[----------] Global test environment tear-down
[==========] 184 tests from 52 test cases ran. (50131 ms total)
[ PASSED ] 183 tests.
[ FAILED ] 1 test, listed below:
[ FAILED ] OpenMeshTrimeshCirculatorHalfedgeLoop.CWAndCCWCheck

1 FAILED TEST
ERROR: Build failed: exit status 1
failed
VS2015-32-bit-static-no-apps Test There is an unknown failure, please try again

[----------] Global test environment tear-down
[==========] 196 tests from 54 test cases ran. (57876 ms total)
[ PASSED ] 195 tests.
[ FAILED ] 1 test, listed below:
[ FAILED ] OpenMeshTrimeshCirculatorHalfedgeLoop.CWAndCCWCheck

1 FAILED TEST
ERROR: Build failed: exit status 1
failed
VS2015-32-bit-static-apps Test There is an unknown failure, please try again

[----------] Global test environment tear-down
[==========] 196 tests from 54 test cases ran. (56821 ms total)
[ PASSED ] 195 tests.
[ FAILED ] 1 test, listed below:
[ FAILED ] OpenMeshTrimeshCirculatorHalfedgeLoop.CWAndCCWCheck

1 FAILED TEST
ERROR: Build failed: exit status 1
failed
VS2015-64-bit-static-no-apps Test There is an unknown failure, please try again

[----------] Global test environment tear-down
[==========] 196 tests from 54 test cases ran. (88803 ms total)
[ PASSED ] 195 tests.
[ FAILED ] 1 test, listed below:
[ FAILED ] OpenMeshTrimeshCirculatorHalfedgeLoop.CWAndCCWCheck

1 FAILED TEST
ERROR: Build failed: exit status 1
failed
VS2015-64-bit-static-apps Test There is an unknown failure, please try again

[----------] Global test environment tear-down
[==========] 196 tests from 54 test cases ran. (89742 ms total)
[ PASSED ] 195 tests.
[ FAILED ] 1 test, listed below:
[ FAILED ] OpenMeshTrimeshCirculatorHalfedgeLoop.CWAndCCWCheck

1 FAILED TEST
ERROR: Build failed: exit status 1
failed
VS2015-32-bit-shared-no-apps Test There is an unknown failure, please try again

[----------] Global test environment tear-down
[==========] 196 tests from 54 test cases ran. (58067 ms total)
[ PASSED ] 195 tests.
[ FAILED ] 1 test, listed below:
[ FAILED ] OpenMeshTrimeshCirculatorHalfedgeLoop.CWAndCCWCheck

1 FAILED TEST
ERROR: Build failed: exit status 1
failed
VS2015-32-bit-shared-apps Test There is an unknown failure, please try again

[----------] Global test environment tear-down
[==========] 196 tests from 54 test cases ran. (59663 ms total)
[ PASSED ] 195 tests.
[ FAILED ] 1 test, listed below:
[ FAILED ] OpenMeshTrimeshCirculatorHalfedgeLoop.CWAndCCWCheck

1 FAILED TEST
ERROR: Build failed: exit status 1
failed
VS2015-64-bit-shared-no-apps Test There is an unknown failure, please try again

[----------] Global test environment tear-down
[==========] 196 tests from 54 test cases ran. (89338 ms total)
[ PASSED ] 195 tests.
[ FAILED ] 1 test, listed below:
[ FAILED ] OpenMeshTrimeshCirculatorHalfedgeLoop.CWAndCCWCheck

1 FAILED TEST
ERROR: Build failed: exit status 1
failed
VS2015-64-bit-shared-apps Test There is an unknown failure, please try again

[----------] Global test environment tear-down
[==========] 196 tests from 54 test cases ran. (89729 ms total)
[ PASSED ] 195 tests.
[ FAILED ] 1 test, listed below:
[ FAILED ] OpenMeshTrimeshCirculatorHalfedgeLoop.CWAndCCWCheck

1 FAILED TEST
ERROR: Build failed: exit status 1
failed
macos-c++98 Test There is an unknown failure, please try again
[----------] Global test environment tear-down
[==========] 196 tests from 54 test cases ran. (2588 ms total)
[ PASSED ] 195 tests.
[ FAILED ] 1 test, listed below:
[ FAILED ] OpenMeshTrimeshCirculatorHalfedgeLoop.CWAndCCWCheck

1 FAILED TEST

ERROR: Build failed: exit status 1
failed
macos-c++11 Test There is an unknown failure, please try again
[----------] Global test environment tear-down
[==========] 196 tests from 54 test cases ran. (2587 ms total)
[ PASSED ] 195 tests.
[ FAILED ] 1 test, listed below:
[ FAILED ] OpenMeshTrimeshCirculatorHalfedgeLoop.CWAndCCWCheck

1 FAILED TEST

ERROR: Build failed: exit status 1
failed
clang-c++14 Test There is an unknown failure, please try again

[----------] Global test environment tear-down
[==========] 196 tests from 54 test cases ran. (4068 ms total)
[ PASSED ] 195 tests.
[ FAILED ] 1 test, listed below:
[ FAILED ] OpenMeshTrimeshCirculatorHalfedgeLoop.CWAndCCWCheck

1 FAILED TEST
ERROR: Build failed: exit status 1
failed
gcc-c++14 Test There is an unknown failure, please try again

[----------] Global test environment tear-down
[==========] 196 tests from 54 test cases ran. (5658 ms total)
[ PASSED ] 195 tests.
[ FAILED ] 1 test, listed below:
[ FAILED ] OpenMeshTrimeshCirculatorHalfedgeLoop.CWAndCCWCheck

1 FAILED TEST
ERROR: Build failed: exit status 1
failed
clang-c++11 Test There is an unknown failure, please try again

[----------] Global test environment tear-down
[==========] 196 tests from 54 test cases ran. (6652 ms total)
[ PASSED ] 195 tests.
[ FAILED ] 1 test, listed below:
[ FAILED ] OpenMeshTrimeshCirculatorHalfedgeLoop.CWAndCCWCheck

1 FAILED TEST
ERROR: Build failed: exit status 1
failed
gcc-c++11 Test There is an unknown failure, please try again

[----------] Global test environment tear-down
[==========] 196 tests from 54 test cases ran. (5356 ms total)
[ PASSED ] 195 tests.
[ FAILED ] 1 test, listed below:
[ FAILED ] OpenMeshTrimeshCirculatorHalfedgeLoop.CWAndCCWCheck

1 FAILED TEST
ERROR: Build failed: exit status 1