Merge branch 'Added_gtest-1.8' into 'master'

Updated finder to search for latest googletest as well

See merge request !124
24 jobs from master in 14 minutes 9 seconds (queued for 1 second)
Status Job ID Name Coverage
  Test
passed #22825
Linux
Doc-publish

00:33

canceled #22819
VS2013
VS2013-32-bit-shared-apps

canceled #22820
VS2013
VS2013-32-bit-shared-no-apps

canceled #22823
VS2013
VS2013-32-bit-static-apps

canceled #22824
VS2013
VS2013-32-bit-static-no-apps

canceled #22817
VS2013
VS2013-64-bit-shared-apps

canceled #22818
VS2013
VS2013-64-bit-shared-no-apps

canceled #22821
VS2013
VS2013-64-bit-static-apps

canceled #22822
VS2013
VS2013-64-bit-static-no-apps

canceled #22811
VS2015
VS2015-32-bit-shared-apps

canceled #22812
VS2015
VS2015-32-bit-shared-no-apps

canceled #22815
VS2015
VS2015-32-bit-static-apps

canceled #22816
VS2015
VS2015-32-bit-static-no-apps

canceled #22809
VS2015
VS2015-64-bit-shared-apps

canceled #22810
VS2015
VS2015-64-bit-shared-no-apps

canceled #22813
VS2015
VS2015-64-bit-static-apps

canceled #22814
VS2015
VS2015-64-bit-static-no-apps

canceled #22803
Linux
clang-c++11

14:07

canceled #22805
Linux
clang-c++98

13:36

failed #22808
Linux
cppcheck

01:56

passed #22802
Linux
gcc-c++11

04:42

failed #22804
Linux
gcc-c++98

01:52

passed #22806
Apple
macos-c++11

09:39

canceled #22807
Apple
macos-c++98

02:40

 
Test cppcheck

==============================================================================
CPPCHECK Summary
==============================================================================


Total CPPCHECK error Count is 19, which is too High! CPPCHECK Run failed

ERROR: Build failed: exit status 1
Test gcc-c++98
/usr/bin/ld: final link failed: Nonrepresentable section on output
collect2: error: ld returned 1 exit status
src/Unittests/CMakeFiles/unittests.dir/build.make:1294: recipe for target 'Unittests/unittests' failed
make[2]: *** [Unittests/unittests] Error 1
CMakeFiles/Makefile2:1088: recipe for target 'src/Unittests/CMakeFiles/unittests.dir/all' failed
make[1]: *** [src/Unittests/CMakeFiles/unittests.dir/all] Error 2
Makefile:149: recipe for target 'all' failed
make: *** [all] Error 2
ERROR: Build failed: exit status 1