Fixed explicit making cppcheck fail and some lineendings

25 jobs for python_strip_string_fix in 44 minutes and 40 seconds (queued for 5 seconds)
Status Job ID Name Coverage
  Test
passed #22641
VS2013
VS2013-32-bit-shared-apps

00:04:49

passed #22642
VS2013
VS2013-32-bit-shared-no-apps

00:03:29

passed #22645
VS2013
VS2013-32-bit-static-apps

00:04:35

passed #22646
VS2013
VS2013-32-bit-static-no-apps

00:03:47

passed #22639
VS2013
VS2013-64-bit-shared-apps

00:04:49

passed #22640
VS2013
VS2013-64-bit-shared-no-apps

00:03:57

passed #22643
VS2013
VS2013-64-bit-static-apps

00:04:57

passed #22644
VS2013
VS2013-64-bit-static-no-apps

00:04:09

passed #22633
VS2015
VS2015-32-bit-shared-apps

00:06:14

passed #22634
VS2015
VS2015-32-bit-shared-no-apps

00:05:15

passed #22637
VS2015
VS2015-32-bit-static-apps

00:06:08

passed #22638
VS2015
VS2015-32-bit-static-no-apps

00:05:03

passed #22631
VS2015
VS2015-64-bit-shared-apps

00:07:29

passed #22632
VS2015
VS2015-64-bit-shared-no-apps

00:05:34

passed #22635
VS2015
VS2015-64-bit-static-apps

00:06:54

passed #22636
VS2015
VS2015-64-bit-static-no-apps

00:05:42

passed #22625
Linux
clang-c++11

00:21:57

failed #22671
Linux
clang-c++98

00:07:04

passed #22630
Linux
cppcheck

00:00:31

passed #22624
Linux
gcc-c++11

00:04:29

passed #22626
Linux
gcc-c++98

00:04:50

passed #22628
Apple
macos-c++11

00:09:44

passed #22629
Apple
macos-c++98

00:08:58

failed #22627
Linux
clang-c++98

00:07:13

failed #22670
Linux
clang-c++98

00:07:04

 
Name Stage Failure
failed
clang-c++98 Test There is an unknown failure, please try again
                                                                  ^
1 error generated.
src/Unittests/CMakeFiles/unittests.dir/build.make:398: recipe for target 'src/Unittests/CMakeFiles/unittests.dir/unittests_property.cc.o' failed
make[2]: *** [src/Unittests/CMakeFiles/unittests.dir/unittests_property.cc.o] Error 1
CMakeFiles/Makefile2:1088: recipe for target 'src/Unittests/CMakeFiles/unittests.dir/all' failed
make[1]: *** [src/Unittests/CMakeFiles/unittests.dir/all] Error 2
Makefile:149: recipe for target 'all' failed
make: *** [all] Error 2
ERROR: Build failed: exit status 1