Merge branch 'vectorize_warning_windows_fix' into 'master'

Fixed some windows scalar conversion warnings

See merge request !223
23 jobs for master in 61 minutes and 11 seconds (queued for 1 second)
latest
Status Job ID Name Coverage
  Build
passed #76568
VS2015
VS2015-32-bit-shared-apps

00:08:10

passed #76569
VS2015
VS2015-32-bit-shared-no-apps

00:06:45

passed #76572
VS2015
VS2015-32-bit-static-apps

00:07:44

passed #76573
VS2015
VS2015-32-bit-static-no-apps

00:07:19

passed #76566
VS2015
VS2015-64-bit-shared-apps

00:09:06

passed #76567
VS2015
VS2015-64-bit-shared-no-apps

00:08:17

passed #76570
VS2015
VS2015-64-bit-static-apps

00:09:10

passed #76571
VS2015
VS2015-64-bit-static-no-apps

00:08:36

passed #76563
VS2017
VS2017-32-bit-shared-no-apps

00:07:43

passed #76565
VS2017
VS2017-32-bit-static-no-apps

00:07:48

failed #76560
Qt5101 VS2017
VS2017-64-bit-shared-apps

00:05:54

passed #76562
VS2017
VS2017-64-bit-shared-no-apps

00:07:25

passed #76561
Qt5101 VS2017
VS2017-64-bit-static-apps

00:08:43

passed #76564
VS2017
VS2017-64-bit-static-no-apps

00:08:27

passed #76554
stretch Linux
clang-c++11

00:45:41

passed #76556
stretch Linux
clang-c++14

00:44:36

passed #76559
stretch Linux
cppcheck

00:22:43

passed #76553
stretch Linux
gcc-c++11

00:04:25

passed #76555
stretch Linux
gcc-c++14

00:04:27

passed #76557
Apple
macos-cpp11

00:25:07

passed #76558
Apple
macos-cpp14

00:13:57

 
  Deploy
skipped #76574
stretch Linux
Doc-publish
skipped #76575
stretch Linux
Sources
 
Name Stage Failure
failed
VS2017-64-bit-shared-apps Build
17>C:\Program Files (x86)\Microsoft Visual Studio\2017\Professional\Common7\IDE\VC\VCTargets\Microsoft.CppCommon.targets(138,5): error MSB3073: if %errorlevel% neq 0 goto :VCEnd
17>C:\Program Files (x86)\Microsoft Visual Studio\2017\Professional\Common7\IDE\VC\VCTargets\Microsoft.CppCommon.targets(138,5): error MSB3073: :VCEnd" exited with code 1.
17>Done building project "unittests.vcxproj" -- FAILED.
18>Done building project "unittests_customvec.vcxproj".
20>------ Build started: Project: ALL_BUILD, Configuration: Debug x64 ------
20>Building Custom Rule E:/gitlab/builds/281b716d/0/OpenMesh/OpenMesh/CMakeLists.txt
20>CMake does not need to re-run because E:/gitlab/builds/281b716d/0/OpenMesh/OpenMesh/build-debug/CMakeFiles/generate.stamp is up-to-date.
========== Build: 19 succeeded, 1 failed, 0 up-to-date, 0 skipped ==========
ERROR: Job failed: exit status 1