refs #64

21 jobs for ply_fix in 6 minutes and 50 seconds (queued for 1 second)
Status Job ID Name Coverage
  Build
canceled #65958
VS2015
VS2015-32-bit-shared-apps

canceled #65959
VS2015
VS2015-32-bit-shared-no-apps

canceled #65962
VS2015
VS2015-32-bit-static-apps

canceled #65963
VS2015
VS2015-32-bit-static-no-apps

canceled #65956
VS2015
VS2015-64-bit-shared-apps

00:06:50

canceled #65957
VS2015
VS2015-64-bit-shared-no-apps

00:06:50

canceled #65960
VS2015
VS2015-64-bit-static-apps

canceled #65961
VS2015
VS2015-64-bit-static-no-apps

canceled #65953
VS2017
VS2017-32-bit-shared-no-apps

canceled #65955
VS2017
VS2017-32-bit-static-no-apps

canceled #65950
Qt5101 VS2017
VS2017-64-bit-shared-apps

00:06:47

canceled #65952
VS2017
VS2017-64-bit-shared-no-apps

canceled #65951
Qt5101 VS2017
VS2017-64-bit-static-apps

canceled #65954
VS2017
VS2017-64-bit-static-no-apps

canceled #65944
Linux
clang-c++11

00:06:48

canceled #65946
Linux
clang-c++14

00:06:47

passed #65949
Linux
cppcheck

00:00:07

failed #65943
Linux
gcc-c++11

00:01:39

failed #65945
Linux
gcc-c++14

00:01:41

canceled #65947
Apple
macos-c++11

00:06:48

canceled #65948
Apple
macos-c++98

00:06:47

 
Name Stage Failure
failed
gcc-c++14 Build

[----------] Global test environment tear-down
[==========] 235 tests from 62 test cases ran. (5543 ms total)
[ PASSED ] 234 tests.
[ FAILED ] 1 test, listed below:
[ FAILED ] OpenMeshReadWritePLY.LoadSimplePLYNoEndl

1 FAILED TEST
ERROR: Job failed: exit status 1
failed
gcc-c++11 Build

[----------] Global test environment tear-down
[==========] 235 tests from 62 test cases ran. (5654 ms total)
[ PASSED ] 234 tests.
[ FAILED ] 1 test, listed below:
[ FAILED ] OpenMeshReadWritePLY.LoadSimplePLYNoEndl

1 FAILED TEST
ERROR: Job failed: exit status 1