Preliminary Eigen support. One unittest still fails

refs #59
21 jobs for Eigen in 23 minutes and 16 seconds (queued for 2 seconds)
Status Job ID Name Coverage
  Build
failed #64818
VS2015
VS2015-32-bit-shared-apps

00:03:14

failed #64819
VS2015
VS2015-32-bit-shared-no-apps

00:02:50

failed #64822
VS2015
VS2015-32-bit-static-apps

00:03:14

failed #64823
VS2015
VS2015-32-bit-static-no-apps

00:02:54

failed #64816
VS2015
VS2015-64-bit-shared-apps

00:03:24

failed #64817
VS2015
VS2015-64-bit-shared-no-apps

00:02:55

failed #64820
VS2015
VS2015-64-bit-static-apps

00:03:27

failed #64821
VS2015
VS2015-64-bit-static-no-apps

00:03:00

failed #64813
VS2017
VS2017-32-bit-shared-no-apps

00:03:11

failed #64815
VS2017
VS2017-32-bit-static-no-apps

00:02:57

failed #64810
Qt5101 VS2017
VS2017-64-bit-shared-apps

00:03:37

failed #64812
VS2017
VS2017-64-bit-shared-no-apps

00:03:30

failed #64811
Qt5101 VS2017
VS2017-64-bit-static-apps

00:03:35

failed #64814
VS2017
VS2017-64-bit-static-no-apps

00:03:01

failed #64804
Linux
clang-c++11

00:14:53

failed #64806
Linux
clang-c++14

00:23:14

passed #64809
Linux
cppcheck

00:00:08

failed #64803
Linux
gcc-c++11

00:01:40

failed #64805
Linux
gcc-c++14

00:01:51

failed #64807
Apple
macos-c++11

00:07:33

failed #64808
Apple
macos-c++98

00:13:56

 
Name Stage Failure
failed
clang-c++14 Build

[----------] Global test environment tear-down
[==========] 232 tests from 62 test cases ran. (5899 ms total)
[ PASSED ] 231 tests.
[ FAILED ] 1 test, listed below:
[ FAILED ] OpenMeshEigenTest.Test_external_normalize

1 FAILED TEST
ERROR: Job failed: exit status 1
failed
VS2015-32-bit-static-no-apps Build

Microsoft Visual Studio 2015 Version 14.0.25420.1.
Copyright (C) Microsoft Corp. All rights reserved.

The following files were specified on the command line:

OpenMesh.sln

These files could not be found and will not be loaded.
ERROR: Job failed: exit status 1
failed
VS2015-32-bit-static-apps Build

Microsoft Visual Studio 2015 Version 14.0.25420.1.
Copyright (C) Microsoft Corp. All rights reserved.

The following files were specified on the command line:

OpenMesh.sln

These files could not be found and will not be loaded.
ERROR: Job failed: exit status 1
failed
VS2015-64-bit-static-apps Build

Microsoft Visual Studio 2015 Version 14.0.25420.1.
Copyright (C) Microsoft Corp. All rights reserved.

The following files were specified on the command line:

OpenMesh.sln

These files could not be found and will not be loaded.
ERROR: Job failed: exit status 1
failed
VS2015-64-bit-static-no-apps Build

Microsoft Visual Studio 2015 Version 14.0.25420.1.
Copyright (C) Microsoft Corp. All rights reserved.

The following files were specified on the command line:

OpenMesh.sln

These files could not be found and will not be loaded.
ERROR: Job failed: exit status 1
failed
clang-c++11 Build

[----------] Global test environment tear-down
[==========] 232 tests from 62 test cases ran. (4166 ms total)
[ PASSED ] 231 tests.
[ FAILED ] 1 test, listed below:
[ FAILED ] OpenMeshEigenTest.Test_external_normalize

1 FAILED TEST
ERROR: Job failed: exit status 1
failed
macos-c++98 Build

[----------] Global test environment tear-down
[==========] 232 tests from 62 test cases ran. (3143 ms total)
[ PASSED ] 231 tests.
[ FAILED ] 1 test, listed below:
[ FAILED ] OpenMeshEigenTest.Test_external_normalize

1 FAILED TEST
ERROR: Job failed: exit status 1
failed
VS2015-32-bit-shared-apps Build

Microsoft Visual Studio 2015 Version 14.0.25420.1.
Copyright (C) Microsoft Corp. All rights reserved.

The following files were specified on the command line:

OpenMesh.sln

These files could not be found and will not be loaded.
ERROR: Job failed: exit status 1
failed
VS2015-32-bit-shared-no-apps Build

Microsoft Visual Studio 2015 Version 14.0.25420.1.
Copyright (C) Microsoft Corp. All rights reserved.

The following files were specified on the command line:

OpenMesh.sln

These files could not be found and will not be loaded.
ERROR: Job failed: exit status 1
failed
VS2015-64-bit-shared-apps Build

Microsoft Visual Studio 2015 Version 14.0.25420.1.
Copyright (C) Microsoft Corp. All rights reserved.

The following files were specified on the command line:

OpenMesh.sln

These files could not be found and will not be loaded.
ERROR: Job failed: exit status 1
failed
VS2015-64-bit-shared-no-apps Build

Microsoft Visual Studio 2015 Version 14.0.25420.1.
Copyright (C) Microsoft Corp. All rights reserved.

The following files were specified on the command line:

OpenMesh.sln

These files could not be found and will not be loaded.
ERROR: Job failed: exit status 1
failed
macos-c++11 Build

[----------] Global test environment tear-down
[==========] 232 tests from 62 test cases ran. (2565 ms total)
[ PASSED ] 231 tests.
[ FAILED ] 1 test, listed below:
[ FAILED ] OpenMeshEigenTest.Test_external_normalize

1 FAILED TEST
ERROR: Job failed: exit status 1
failed
VS2017-32-bit-shared-no-apps Build

Microsoft Visual Studio 2017 Version 15.0.26430.16.
Copyright (C) Microsoft Corp. All rights reserved.

The following files were specified on the command line:

OpenMesh.sln

These files could not be found and will not be loaded.
ERROR: Job failed: exit status 1
failed
VS2017-64-bit-static-no-apps Build

Microsoft Visual Studio 2017 Version 15.0.26430.16.
Copyright (C) Microsoft Corp. All rights reserved.

The following files were specified on the command line:

OpenMesh.sln

These files could not be found and will not be loaded.
ERROR: Job failed: exit status 1
failed
VS2017-32-bit-static-no-apps Build

Microsoft Visual Studio 2017 Version 15.0.28010.2036.
Copyright (C) Microsoft Corp. All rights reserved.

The following files were specified on the command line:

OpenMesh.sln

These files could not be found and will not be loaded.
ERROR: Job failed: exit status 1
failed
VS2017-64-bit-shared-apps Build

Microsoft Visual Studio 2017 Version 15.0.28010.2036.
Copyright (C) Microsoft Corp. All rights reserved.

The following files were specified on the command line:

OpenMesh.sln

These files could not be found and will not be loaded.
ERROR: Job failed: exit status 1
failed
VS2017-64-bit-static-apps Build

Microsoft Visual Studio 2017 Version 15.0.26430.16.
Copyright (C) Microsoft Corp. All rights reserved.

The following files were specified on the command line:

OpenMesh.sln

These files could not be found and will not be loaded.
ERROR: Job failed: exit status 1
failed
VS2017-64-bit-shared-no-apps Build

Microsoft Visual Studio 2017 Version 15.0.26430.16.
Copyright (C) Microsoft Corp. All rights reserved.

The following files were specified on the command line:

OpenMesh.sln

These files could not be found and will not be loaded.
ERROR: Job failed: exit status 1
failed
gcc-c++14 Build

[----------] Global test environment tear-down
[==========] 232 tests from 62 test cases ran. (6297 ms total)
[ PASSED ] 231 tests.
[ FAILED ] 1 test, listed below:
[ FAILED ] OpenMeshEigenTest.Test_external_normalize

1 FAILED TEST
ERROR: Job failed: exit status 1
failed
gcc-c++11 Build

[----------] Global test environment tear-down
[==========] 232 tests from 62 test cases ran. (3912 ms total)
[ PASSED ] 231 tests.
[ FAILED ] 1 test, listed below:
[ FAILED ] OpenMeshEigenTest.Test_external_normalize

1 FAILED TEST
ERROR: Job failed: exit status 1