const ref for parameter

29 jobs for OBJ_vcolor_support in 70 minutes and 5 seconds (queued for 3 seconds)
latest
Status Job ID Name Coverage
  Build
passed #59303
VS2013
VS2013-32-bit-shared-apps

00:06:05

passed #59304
VS2013
VS2013-32-bit-shared-no-apps

00:04:54

passed #59307
VS2013
VS2013-32-bit-static-apps

00:06:15

passed #59308
VS2013
VS2013-32-bit-static-no-apps

00:05:01

failed #59301
VS2013
VS2013-64-bit-shared-apps

00:05:38

passed #59302
VS2013
VS2013-64-bit-shared-no-apps

00:05:29

passed #59305
VS2013
VS2013-64-bit-static-apps

00:07:02

passed #59306
VS2013
VS2013-64-bit-static-no-apps

00:05:42

failed #59295
VS2015
VS2015-32-bit-shared-apps

00:06:33

passed #59296
VS2015
VS2015-32-bit-shared-no-apps

00:06:55

failed #59299
VS2015
VS2015-32-bit-static-apps

00:06:35

passed #59300
VS2015
VS2015-32-bit-static-no-apps

00:07:04

failed #59293
VS2015
VS2015-64-bit-shared-apps

00:07:53

passed #59294
VS2015
VS2015-64-bit-shared-no-apps

00:08:13

failed #59297
VS2015
VS2015-64-bit-static-apps

00:02:33

passed #59298
VS2015
VS2015-64-bit-static-no-apps

00:08:27

passed #59290
VS2017
VS2017-32-bit-shared-no-apps

00:06:07

passed #59292
VS2017
VS2017-32-bit-static-no-apps

00:07:41

passed #59287
Qt5101 VS2017
VS2017-64-bit-shared-apps

00:08:01

passed #59289
VS2017
VS2017-64-bit-shared-no-apps

00:08:45

failed #59288
Qt5101 VS2017
VS2017-64-bit-static-apps

00:08:19

passed #59291
VS2017
VS2017-64-bit-static-no-apps

00:08:16

passed #59281
Linux
clang-c++11

00:19:05

passed #59283
Linux
clang-c++14

00:37:06

passed #59286
Linux
cppcheck

00:00:08

passed #59280
Linux
gcc-c++11

00:03:33

passed #59282
Linux
gcc-c++14

00:04:02

passed #59284
Apple
macos-c++11

00:23:48

passed #59285
Apple
macos-c++98

00:13:08

 
Name Stage Failure
failed
VS2013-64-bit-shared-apps Build
4>C:\Program Files (x86)\MSBuild\Microsoft.Cpp\v4.0\V120\Microsoft.CppCommon.targets(132,5): error MSB3073: :cmDone
4>C:\Program Files (x86)\MSBuild\Microsoft.Cpp\v4.0\V120\Microsoft.CppCommon.targets(132,5): error MSB3073: if %errorlevel% neq 0 goto :VCEnd
4>C:\Program Files (x86)\MSBuild\Microsoft.Cpp\v4.0\V120\Microsoft.CppCommon.targets(132,5): error MSB3073: :VCEnd" exited with code 1.
4>
4>Build FAILED.
4>
4>Time Elapsed 00:00:00.31
========== Build: 3 succeeded, 1 failed, 12 up-to-date, 0 skipped ==========
ERROR: Job failed: exit status 1
failed
VS2015-32-bit-static-apps Build
4>C:\Program Files (x86)\MSBuild\Microsoft.Cpp\v4.0\V140\Microsoft.CppCommon.targets(133,5): error MSB3073: :cmEnd
4>C:\Program Files (x86)\MSBuild\Microsoft.Cpp\v4.0\V140\Microsoft.CppCommon.targets(133,5): error MSB3073: endlocal & call :cmErrorLevel %errorlevel% & goto :cmDone
4>C:\Program Files (x86)\MSBuild\Microsoft.Cpp\v4.0\V140\Microsoft.CppCommon.targets(133,5): error MSB3073: :cmErrorLevel
4>C:\Program Files (x86)\MSBuild\Microsoft.Cpp\v4.0\V140\Microsoft.CppCommon.targets(133,5): error MSB3073: exit /b %1
4>C:\Program Files (x86)\MSBuild\Microsoft.Cpp\v4.0\V140\Microsoft.CppCommon.targets(133,5): error MSB3073: :cmDone
4>C:\Program Files (x86)\MSBuild\Microsoft.Cpp\v4.0\V140\Microsoft.CppCommon.targets(133,5): error MSB3073: if %errorlevel% neq 0 goto :VCEnd
4>C:\Program Files (x86)\MSBuild\Microsoft.Cpp\v4.0\V140\Microsoft.CppCommon.targets(133,5): error MSB3073: :VCEnd" exited with code 1.
========== Build: 3 succeeded, 1 failed, 12 up-to-date, 0 skipped ==========
ERROR: Job failed: exit status 1
failed
VS2015-64-bit-static-apps Build
12>C:\Program Files (x86)\MSBuild\Microsoft.Cpp\v4.0\V140\Microsoft.CppCommon.targets(133,5): error MSB3073: exit /b %1
12>C:\Program Files (x86)\MSBuild\Microsoft.Cpp\v4.0\V140\Microsoft.CppCommon.targets(133,5): error MSB3073: :cmDone
12>C:\Program Files (x86)\MSBuild\Microsoft.Cpp\v4.0\V140\Microsoft.CppCommon.targets(133,5): error MSB3073: if %errorlevel% neq 0 goto :VCEnd
12>C:\Program Files (x86)\MSBuild\Microsoft.Cpp\v4.0\V140\Microsoft.CppCommon.targets(133,5): error MSB3073: :VCEnd" exited with code 1.
15>------ Build started: Project: ALL_BUILD, Configuration: Release x64 ------
15> Building Custom Rule E:/gitlab/builds/281b716d/0/OpenMesh/OpenMesh/CMakeLists.txt
15> CMake does not need to re-run because E:/gitlab/builds/281b716d/0/OpenMesh/OpenMesh/build-release/CMakeFiles/generate.stamp is up-to-date.
========== Build: 14 succeeded, 1 failed, 0 up-to-date, 0 skipped ==========
ERROR: Job failed: exit status 1
failed
VS2015-32-bit-shared-apps Build
4>C:\Program Files (x86)\MSBuild\Microsoft.Cpp\v4.0\V140\Microsoft.CppCommon.targets(133,5): error MSB3073: :cmEnd
4>C:\Program Files (x86)\MSBuild\Microsoft.Cpp\v4.0\V140\Microsoft.CppCommon.targets(133,5): error MSB3073: endlocal & call :cmErrorLevel %errorlevel% & goto :cmDone
4>C:\Program Files (x86)\MSBuild\Microsoft.Cpp\v4.0\V140\Microsoft.CppCommon.targets(133,5): error MSB3073: :cmErrorLevel
4>C:\Program Files (x86)\MSBuild\Microsoft.Cpp\v4.0\V140\Microsoft.CppCommon.targets(133,5): error MSB3073: exit /b %1
4>C:\Program Files (x86)\MSBuild\Microsoft.Cpp\v4.0\V140\Microsoft.CppCommon.targets(133,5): error MSB3073: :cmDone
4>C:\Program Files (x86)\MSBuild\Microsoft.Cpp\v4.0\V140\Microsoft.CppCommon.targets(133,5): error MSB3073: if %errorlevel% neq 0 goto :VCEnd
4>C:\Program Files (x86)\MSBuild\Microsoft.Cpp\v4.0\V140\Microsoft.CppCommon.targets(133,5): error MSB3073: :VCEnd" exited with code 1.
========== Build: 3 succeeded, 1 failed, 12 up-to-date, 0 skipped ==========
ERROR: Job failed: exit status 1
failed
VS2015-64-bit-shared-apps Build
4>C:\Program Files (x86)\MSBuild\Microsoft.Cpp\v4.0\V140\Microsoft.CppCommon.targets(133,5): error MSB3073: :cmEnd
4>C:\Program Files (x86)\MSBuild\Microsoft.Cpp\v4.0\V140\Microsoft.CppCommon.targets(133,5): error MSB3073: endlocal & call :cmErrorLevel %errorlevel% & goto :cmDone
4>C:\Program Files (x86)\MSBuild\Microsoft.Cpp\v4.0\V140\Microsoft.CppCommon.targets(133,5): error MSB3073: :cmErrorLevel
4>C:\Program Files (x86)\MSBuild\Microsoft.Cpp\v4.0\V140\Microsoft.CppCommon.targets(133,5): error MSB3073: exit /b %1
4>C:\Program Files (x86)\MSBuild\Microsoft.Cpp\v4.0\V140\Microsoft.CppCommon.targets(133,5): error MSB3073: :cmDone
4>C:\Program Files (x86)\MSBuild\Microsoft.Cpp\v4.0\V140\Microsoft.CppCommon.targets(133,5): error MSB3073: if %errorlevel% neq 0 goto :VCEnd
4>C:\Program Files (x86)\MSBuild\Microsoft.Cpp\v4.0\V140\Microsoft.CppCommon.targets(133,5): error MSB3073: :VCEnd" exited with code 1.
========== Build: 3 succeeded, 1 failed, 12 up-to-date, 0 skipped ==========
ERROR: Job failed: exit status 1
failed
VS2017-64-bit-static-apps Build
4>C:\Program Files (x86)\Microsoft Visual Studio\2017\Professional\Common7\IDE\VC\VCTargets\Microsoft.CppCommon.targets(133,5): error MSB3073: endlocal & call :cmErrorLevel %errorlevel% & goto :cmDone
4>C:\Program Files (x86)\Microsoft Visual Studio\2017\Professional\Common7\IDE\VC\VCTargets\Microsoft.CppCommon.targets(133,5): error MSB3073: :cmErrorLevel
4>C:\Program Files (x86)\Microsoft Visual Studio\2017\Professional\Common7\IDE\VC\VCTargets\Microsoft.CppCommon.targets(133,5): error MSB3073: exit /b %1
4>C:\Program Files (x86)\Microsoft Visual Studio\2017\Professional\Common7\IDE\VC\VCTargets\Microsoft.CppCommon.targets(133,5): error MSB3073: :cmDone
4>C:\Program Files (x86)\Microsoft Visual Studio\2017\Professional\Common7\IDE\VC\VCTargets\Microsoft.CppCommon.targets(133,5): error MSB3073: if %errorlevel% neq 0 goto :VCEnd
4>C:\Program Files (x86)\Microsoft Visual Studio\2017\Professional\Common7\IDE\VC\VCTargets\Microsoft.CppCommon.targets(133,5): error MSB3073: :VCEnd" exited with code 1.
4>Done building project "PACKAGE.vcxproj" -- FAILED.
========== Build: 3 succeeded, 1 failed, 12 up-to-date, 0 skipped ==========
ERROR: Job failed: exit status 1