add test to check if status is correctly written to file and loaded from file

29 jobs for persistent_edge_properties in 78 minutes and 31 seconds (queued for 4 seconds)
Status Job ID Name Coverage
  Build
failed #57186
VS2013
VS2013-32-bit-shared-apps

00:05:30

failed #57187
VS2013
VS2013-32-bit-shared-no-apps

00:04:36

failed #57190
VS2013
VS2013-32-bit-static-apps

00:05:31

failed #57191
VS2013
VS2013-32-bit-static-no-apps

00:04:37

failed #57184
VS2013
VS2013-64-bit-shared-apps

00:06:09

failed #57185
VS2013
VS2013-64-bit-shared-no-apps

00:05:09

failed #57188
VS2013
VS2013-64-bit-static-apps

00:06:12

failed #57189
VS2013
VS2013-64-bit-static-no-apps

00:05:12

failed #57178
VS2015
VS2015-32-bit-shared-apps

00:00:12

failed #57179
VS2015
VS2015-32-bit-shared-no-apps

00:00:11

failed #57182
VS2015
VS2015-32-bit-static-apps

00:00:12

failed #57183
VS2015
VS2015-32-bit-static-no-apps

00:00:11

failed #57176
VS2015
VS2015-64-bit-shared-apps

00:00:12

failed #57177
VS2015
VS2015-64-bit-shared-no-apps

00:00:11

failed #57180
VS2015
VS2015-64-bit-static-apps

00:00:12

failed #57181
VS2015
VS2015-64-bit-static-no-apps

00:00:11

failed #57173
VS2017
VS2017-32-bit-shared-no-apps

00:06:29

failed #57175
VS2017
VS2017-32-bit-static-no-apps

00:06:31

failed #57170
Qt5101 VS2017
VS2017-64-bit-shared-apps

00:07:16

failed #57172
VS2017
VS2017-64-bit-shared-no-apps

00:08:21

failed #57171
Qt5101 VS2017
VS2017-64-bit-static-apps

00:07:24

failed #57174
VS2017
VS2017-64-bit-static-no-apps

00:06:50

failed #57164
Linux
clang-c++11

00:15:15

failed #57166
Linux
clang-c++14

00:22:50

passed #57169
Linux
cppcheck

00:00:08

failed #57163
Linux
gcc-c++11

00:01:39

failed #57165
Linux
gcc-c++14

00:01:44

failed #57167
Apple
macos-c++11

00:07:00

failed #57168
Apple
macos-c++98

00:06:59

 
Name Stage Failure
failed
VS2013-32-bit-static-apps Build

[----------] Global test environment tear-down
[==========] 207 tests from 58 test cases ran. (38776 ms total)
[ PASSED ] 206 tests.
[ FAILED ] 1 test, listed below:
[ FAILED ] OpenMeshReadWriteOM.WriteSplitTriangleStatusProperties

1 FAILED TEST
ERROR: Job failed: exit status 1
failed
VS2013-32-bit-static-no-apps Build

[----------] Global test environment tear-down
[==========] 207 tests from 58 test cases ran. (37852 ms total)
[ PASSED ] 206 tests.
[ FAILED ] 1 test, listed below:
[ FAILED ] OpenMeshReadWriteOM.WriteSplitTriangleStatusProperties

1 FAILED TEST
ERROR: Job failed: exit status 1
failed
VS2013-64-bit-static-no-apps Build

[----------] Global test environment tear-down
[==========] 207 tests from 58 test cases ran. (50248 ms total)
[ PASSED ] 206 tests.
[ FAILED ] 1 test, listed below:
[ FAILED ] OpenMeshReadWriteOM.WriteSplitTriangleStatusProperties

1 FAILED TEST
ERROR: Job failed: exit status 1
failed
VS2013-64-bit-static-apps Build

[----------] Global test environment tear-down
[==========] 207 tests from 58 test cases ran. (52132 ms total)
[ PASSED ] 206 tests.
[ FAILED ] 1 test, listed below:
[ FAILED ] OpenMeshReadWriteOM.WriteSplitTriangleStatusProperties

1 FAILED TEST
ERROR: Job failed: exit status 1
failed
VS2013-32-bit-shared-no-apps Build

[----------] Global test environment tear-down
[==========] 207 tests from 58 test cases ran. (37879 ms total)
[ PASSED ] 206 tests.
[ FAILED ] 1 test, listed below:
[ FAILED ] OpenMeshReadWriteOM.WriteSplitTriangleStatusProperties

1 FAILED TEST
ERROR: Job failed: exit status 1
failed
VS2013-32-bit-shared-apps Build

[----------] Global test environment tear-down
[==========] 207 tests from 58 test cases ran. (39126 ms total)
[ PASSED ] 206 tests.
[ FAILED ] 1 test, listed below:
[ FAILED ] OpenMeshReadWriteOM.WriteSplitTriangleStatusProperties

1 FAILED TEST
ERROR: Job failed: exit status 1
failed
VS2013-64-bit-shared-no-apps Build

[----------] Global test environment tear-down
[==========] 207 tests from 58 test cases ran. (51047 ms total)
[ PASSED ] 206 tests.
[ FAILED ] 1 test, listed below:
[ FAILED ] OpenMeshReadWriteOM.WriteSplitTriangleStatusProperties

1 FAILED TEST
ERROR: Job failed: exit status 1
failed
VS2013-64-bit-shared-apps Build

[----------] Global test environment tear-down
[==========] 207 tests from 58 test cases ran. (52019 ms total)
[ PASSED ] 206 tests.
[ FAILED ] 1 test, listed below:
[ FAILED ] OpenMeshReadWriteOM.WriteSplitTriangleStatusProperties

1 FAILED TEST
ERROR: Job failed: exit status 1
failed
VS2017-32-bit-static-no-apps Build

[----------] Global test environment tear-down
[==========] 211 tests from 58 test cases ran. (56994 ms total)
[ PASSED ] 210 tests.
[ FAILED ] 1 test, listed below:
[ FAILED ] OpenMeshReadWriteOM.WriteSplitTriangleStatusProperties

1 FAILED TEST
ERROR: Job failed: exit status 1
failed
VS2015-32-bit-static-no-apps Build
-- Generating done
-- Build files have been written to: E:/gitlab/builds/7949bd93/0/OpenMesh/OpenMesh/build-release

Microsoft Visual Studio 2015 Version 14.0.25420.1.
Copyright (C) Microsoft Corp. All rights reserved.

The license for Visual Studio has expired.

Your license for this product is expired and could not be refreshed. Please connect to the internet to continue to use this product.
ERROR: Job failed: exit status 1
failed
VS2015-32-bit-static-apps Build
-- Generating done
-- Build files have been written to: E:/gitlab/builds/1900f1de/0/OpenMesh/OpenMesh/build-release

Microsoft Visual Studio 2015 Version 14.0.25420.1.
Copyright (C) Microsoft Corp. All rights reserved.

The license for Visual Studio has expired.

Your license for this product is expired and could not be refreshed. Please connect to the internet to continue to use this product.
ERROR: Job failed: exit status 1
failed
VS2015-64-bit-static-no-apps Build
-- Generating done
-- Build files have been written to: E:/gitlab/builds/7949bd93/0/OpenMesh/OpenMesh/build-release

Microsoft Visual Studio 2015 Version 14.0.25420.1.
Copyright (C) Microsoft Corp. All rights reserved.

The license for Visual Studio has expired.

Your license for this product is expired and could not be refreshed. Please connect to the internet to continue to use this product.
ERROR: Job failed: exit status 1
failed
VS2015-64-bit-static-apps Build
-- Generating done
-- Build files have been written to: E:/gitlab/builds/1900f1de/0/OpenMesh/OpenMesh/build-release

Microsoft Visual Studio 2015 Version 14.0.25420.1.
Copyright (C) Microsoft Corp. All rights reserved.

The license for Visual Studio has expired.

Your license for this product is expired and could not be refreshed. Please connect to the internet to continue to use this product.
ERROR: Job failed: exit status 1
failed
VS2015-32-bit-shared-no-apps Build
-- Generating done
-- Build files have been written to: E:/gitlab/builds/7949bd93/0/OpenMesh/OpenMesh/build-release

Microsoft Visual Studio 2015 Version 14.0.25420.1.
Copyright (C) Microsoft Corp. All rights reserved.

The license for Visual Studio has expired.

Your license for this product is expired and could not be refreshed. Please connect to the internet to continue to use this product.
ERROR: Job failed: exit status 1
failed
VS2015-32-bit-shared-apps Build
-- Generating done
-- Build files have been written to: E:/gitlab/builds/1900f1de/0/OpenMesh/OpenMesh/build-release

Microsoft Visual Studio 2015 Version 14.0.25420.1.
Copyright (C) Microsoft Corp. All rights reserved.

The license for Visual Studio has expired.

Your license for this product is expired and could not be refreshed. Please connect to the internet to continue to use this product.
ERROR: Job failed: exit status 1
failed
VS2015-64-bit-shared-no-apps Build
-- Generating done
-- Build files have been written to: E:/gitlab/builds/7949bd93/0/OpenMesh/OpenMesh/build-release

Microsoft Visual Studio 2015 Version 14.0.25420.1.
Copyright (C) Microsoft Corp. All rights reserved.

The license for Visual Studio has expired.

Your license for this product is expired and could not be refreshed. Please connect to the internet to continue to use this product.
ERROR: Job failed: exit status 1
failed
VS2015-64-bit-shared-apps Build
-- Generating done
-- Build files have been written to: E:/gitlab/builds/1900f1de/0/OpenMesh/OpenMesh/build-release

Microsoft Visual Studio 2015 Version 14.0.25420.1.
Copyright (C) Microsoft Corp. All rights reserved.

The license for Visual Studio has expired.

Your license for this product is expired and could not be refreshed. Please connect to the internet to continue to use this product.
ERROR: Job failed: exit status 1
failed
VS2017-64-bit-shared-no-apps Build

[----------] Global test environment tear-down
[==========] 211 tests from 58 test cases ran. (88348 ms total)
[ PASSED ] 210 tests.
[ FAILED ] 1 test, listed below:
[ FAILED ] OpenMeshReadWriteOM.WriteSplitTriangleStatusProperties

1 FAILED TEST
ERROR: Job failed: exit status 1
failed
VS2017-64-bit-static-no-apps Build

[----------] Global test environment tear-down
[==========] 211 tests from 58 test cases ran. (75927 ms total)
[ PASSED ] 210 tests.
[ FAILED ] 1 test, listed below:
[ FAILED ] OpenMeshReadWriteOM.WriteSplitTriangleStatusProperties

1 FAILED TEST
ERROR: Job failed: exit status 1
failed
VS2017-32-bit-shared-no-apps Build

[----------] Global test environment tear-down
[==========] 211 tests from 58 test cases ran. (57580 ms total)
[ PASSED ] 210 tests.
[ FAILED ] 1 test, listed below:
[ FAILED ] OpenMeshReadWriteOM.WriteSplitTriangleStatusProperties

1 FAILED TEST
ERROR: Job failed: exit status 1
failed
VS2017-64-bit-static-apps Build

[----------] Global test environment tear-down
[==========] 211 tests from 58 test cases ran. (74870 ms total)
[ PASSED ] 210 tests.
[ FAILED ] 1 test, listed below:
[ FAILED ] OpenMeshReadWriteOM.WriteSplitTriangleStatusProperties

1 FAILED TEST
ERROR: Job failed: exit status 1
failed
VS2017-64-bit-shared-apps Build

[----------] Global test environment tear-down
[==========] 211 tests from 58 test cases ran. (75133 ms total)
[ PASSED ] 210 tests.
[ FAILED ] 1 test, listed below:
[ FAILED ] OpenMeshReadWriteOM.WriteSplitTriangleStatusProperties

1 FAILED TEST
ERROR: Job failed: exit status 1
failed
macos-c++98 Build

[----------] Global test environment tear-down
[==========] 211 tests from 58 test cases ran. (2537 ms total)
[ PASSED ] 210 tests.
[ FAILED ] 1 test, listed below:
[ FAILED ] OpenMeshReadWriteOM.WriteSplitTriangleStatusProperties

1 FAILED TEST
ERROR: Job failed: exit status 1
failed
clang-c++14 Build

[----------] Global test environment tear-down
[==========] 211 tests from 58 test cases ran. (6351 ms total)
[ PASSED ] 210 tests.
[ FAILED ] 1 test, listed below:
[ FAILED ] OpenMeshReadWriteOM.WriteSplitTriangleStatusProperties

1 FAILED TEST
ERROR: Job failed: exit status 1
failed
macos-c++11 Build

[----------] Global test environment tear-down
[==========] 211 tests from 58 test cases ran. (2607 ms total)
[ PASSED ] 210 tests.
[ FAILED ] 1 test, listed below:
[ FAILED ] OpenMeshReadWriteOM.WriteSplitTriangleStatusProperties

1 FAILED TEST
ERROR: Job failed: exit status 1
failed
clang-c++11 Build

[----------] Global test environment tear-down
[==========] 211 tests from 58 test cases ran. (4574 ms total)
[ PASSED ] 210 tests.
[ FAILED ] 1 test, listed below:
[ FAILED ] OpenMeshReadWriteOM.WriteSplitTriangleStatusProperties

1 FAILED TEST
ERROR: Job failed: exit status 1
failed
gcc-c++14 Build

[----------] Global test environment tear-down
[==========] 211 tests from 58 test cases ran. (5934 ms total)
[ PASSED ] 210 tests.
[ FAILED ] 1 test, listed below:
[ FAILED ] OpenMeshReadWriteOM.WriteSplitTriangleStatusProperties

1 FAILED TEST
ERROR: Job failed: exit status 1
failed
gcc-c++11 Build

[----------] Global test environment tear-down
[==========] 211 tests from 58 test cases ran. (5690 ms total)
[ PASSED ] 210 tests.
[ FAILED ] 1 test, listed below:
[ FAILED ] OpenMeshReadWriteOM.WriteSplitTriangleStatusProperties

1 FAILED TEST
ERROR: Job failed: exit status 1