Extended OM2Format to also save the dimension of texcoords.

29 jobs for om2-format in 81 minutes and 1 second (queued for 4 seconds)
latest
Status Job ID Name Coverage
  Build
failed #56401
VS2013
VS2013-32-bit-shared-apps

00:01:52

failed #56402
VS2013
VS2013-32-bit-shared-no-apps

00:01:51

failed #56405
VS2013
VS2013-32-bit-static-apps

00:01:56

failed #56406
VS2013
VS2013-32-bit-static-no-apps

00:01:55

failed #56399
VS2013
VS2013-64-bit-shared-apps

00:02:15

failed #56400
VS2013
VS2013-64-bit-shared-no-apps

00:01:44

failed #56403
VS2013
VS2013-64-bit-static-apps

00:02:02

failed #56404
VS2013
VS2013-64-bit-static-no-apps

00:02:00

failed #56393
VS2015
VS2015-32-bit-shared-apps

00:06:48

failed #56394
VS2015
VS2015-32-bit-shared-no-apps

00:05:24

passed #56397
VS2015
VS2015-32-bit-static-apps

00:07:59

passed #56398
VS2015
VS2015-32-bit-static-no-apps

00:06:22

failed #56391
VS2015
VS2015-64-bit-shared-apps

00:07:43

failed #56392
VS2015
VS2015-64-bit-shared-no-apps

00:06:16

passed #56395
VS2015
VS2015-64-bit-static-apps

00:09:35

passed #56396
VS2015
VS2015-64-bit-static-no-apps

00:07:41

failed #56388
VS2017
VS2017-32-bit-shared-no-apps

00:05:20

passed #56390
VS2017
VS2017-32-bit-static-no-apps

00:06:51

failed #56385
Qt5101 VS2017
VS2017-64-bit-shared-apps

00:06:34

failed #56387
VS2017
VS2017-64-bit-shared-no-apps

00:06:01

passed #56386
Qt5101 VS2017
VS2017-64-bit-static-apps

00:08:02

passed #56389
VS2017
VS2017-64-bit-static-no-apps

00:07:13

failed #56379
Linux
clang-c++11

00:16:04

failed #56381
Linux
clang-c++14

00:22:57

failed #56384
Linux
cppcheck

00:00:08

failed #56378
Linux
gcc-c++11

00:01:51

failed #56380
Linux
gcc-c++14

00:01:50

failed #56382
Apple
macos-c++11

00:07:05

failed #56383
Apple
macos-c++98

00:13:16

 
Name Stage Failure
failed
VS2013-32-bit-static-no-apps Build
5>  unittests_vector_type.cc
5> Generating Code...
4>LINK : fatal error LNK1181: cannot open input file '..\OpenMesh\Core\Release\OpenMeshCore.lib'
5>LINK : fatal error LNK1181: cannot open input file '..\OpenMesh\Core\Release\OpenMeshCore.lib'
6>------ Build started: Project: ALL_BUILD, Configuration: Release Win32 ------
6> Building Custom Rule E:/gitlab/builds/7949bd93/0/OpenMesh/OpenMesh/CMakeLists.txt
6> CMake does not need to re-run because E:/gitlab/builds/7949bd93/0/OpenMesh/OpenMesh/build-release/CMakeFiles/generate.stamp is up-to-date.
========== Build: 3 succeeded, 3 failed, 0 up-to-date, 0 skipped ==========
ERROR: Job failed: exit status 1
failed
VS2013-32-bit-static-apps Build
18>  unittests_vector_type.cc
18> Generating Code...
17>LINK : fatal error LNK1181: cannot open input file '..\OpenMesh\Core\Release\OpenMeshCore.lib'
18>LINK : fatal error LNK1181: cannot open input file '..\OpenMesh\Core\Release\OpenMeshCore.lib'
20>------ Build started: Project: ALL_BUILD, Configuration: Release Win32 ------
20> Building Custom Rule E:/gitlab/builds/2dad8761/0/OpenMesh/OpenMesh/CMakeLists.txt
20> CMake does not need to re-run because E:/gitlab/builds/2dad8761/0/OpenMesh/OpenMesh/build-release/CMakeFiles/generate.stamp is up-to-date.
========== Build: 3 succeeded, 17 failed, 0 up-to-date, 0 skipped ==========
ERROR: Job failed: exit status 1
failed
VS2013-64-bit-static-no-apps Build
5>  unittests_vector_type.cc
5> Generating Code...
4>LINK : fatal error LNK1181: cannot open input file '..\OpenMesh\Core\Release\OpenMeshCore.lib'
5>LINK : fatal error LNK1181: cannot open input file '..\OpenMesh\Core\Release\OpenMeshCore.lib'
6>------ Build started: Project: ALL_BUILD, Configuration: Release x64 ------
6> Building Custom Rule E:/gitlab/builds/1900f1de/0/OpenMesh/OpenMesh/CMakeLists.txt
6> CMake does not need to re-run because E:/gitlab/builds/1900f1de/0/OpenMesh/OpenMesh/build-release/CMakeFiles/generate.stamp is up-to-date.
========== Build: 3 succeeded, 3 failed, 0 up-to-date, 0 skipped ==========
ERROR: Job failed: exit status 1
failed
VS2013-64-bit-static-apps Build
19>  Call Stack (most recent call first):
19> fixbundle.win.cmake:24 (fixup_bundle)
19>
19>
20>------ Build started: Project: ALL_BUILD, Configuration: Release x64 ------
20> Building Custom Rule E:/gitlab/builds/281b716d/0/OpenMesh/OpenMesh/CMakeLists.txt
20> CMake does not need to re-run because E:/gitlab/builds/281b716d/0/OpenMesh/OpenMesh/build-release/CMakeFiles/generate.stamp is up-to-date.
========== Build: 3 succeeded, 17 failed, 0 up-to-date, 0 skipped ==========
ERROR: Job failed: exit status 1
failed
VS2013-32-bit-shared-no-apps Build
5>  unittests_vector_type.cc
5> Generating Code...
4>LINK : fatal error LNK1181: cannot open input file '..\OpenMesh\Tools\Release\OpenMeshTools.lib'
5>LINK : fatal error LNK1181: cannot open input file '..\OpenMesh\Tools\Release\OpenMeshTools.lib'
6>------ Build started: Project: ALL_BUILD, Configuration: Release Win32 ------
6> Building Custom Rule E:/gitlab/builds/7949bd93/0/OpenMesh/OpenMesh/CMakeLists.txt
6> CMake does not need to re-run because E:/gitlab/builds/7949bd93/0/OpenMesh/OpenMesh/build-release/CMakeFiles/generate.stamp is up-to-date.
========== Build: 2 succeeded, 4 failed, 0 up-to-date, 0 skipped ==========
ERROR: Job failed: exit status 1
failed
VS2013-32-bit-shared-apps Build
19>  Call Stack (most recent call first):
19> fixbundle.win.cmake:24 (fixup_bundle)
19>
19>
20>------ Build started: Project: ALL_BUILD, Configuration: Release Win32 ------
20> Building Custom Rule E:/gitlab/builds/2dad8761/0/OpenMesh/OpenMesh/CMakeLists.txt
20> CMake does not need to re-run because E:/gitlab/builds/2dad8761/0/OpenMesh/OpenMesh/build-release/CMakeFiles/generate.stamp is up-to-date.
========== Build: 2 succeeded, 18 failed, 0 up-to-date, 0 skipped ==========
ERROR: Job failed: exit status 1
failed
VS2013-64-bit-shared-apps Build
19>  Call Stack (most recent call first):
19> fixbundle.win.cmake:24 (fixup_bundle)
19>
19>
20>------ Build started: Project: ALL_BUILD, Configuration: Release x64 ------
20> Building Custom Rule E:/gitlab/builds/1900f1de/0/OpenMesh/OpenMesh/CMakeLists.txt
20> CMake does not need to re-run because E:/gitlab/builds/1900f1de/0/OpenMesh/OpenMesh/build-release/CMakeFiles/generate.stamp is up-to-date.
========== Build: 2 succeeded, 18 failed, 0 up-to-date, 0 skipped ==========
ERROR: Job failed: exit status 1
failed
VS2013-64-bit-shared-no-apps Build
5>  unittests_vector_type.cc
5> Generating Code...
4>LINK : fatal error LNK1181: cannot open input file '..\OpenMesh\Tools\Release\OpenMeshTools.lib'
5>LINK : fatal error LNK1181: cannot open input file '..\OpenMesh\Tools\Release\OpenMeshTools.lib'
6>------ Build started: Project: ALL_BUILD, Configuration: Release x64 ------
6> Building Custom Rule E:/gitlab/builds/281b716d/0/OpenMesh/OpenMesh/CMakeLists.txt
6> CMake does not need to re-run because E:/gitlab/builds/281b716d/0/OpenMesh/OpenMesh/build-release/CMakeFiles/generate.stamp is up-to-date.
========== Build: 2 succeeded, 4 failed, 0 up-to-date, 0 skipped ==========
ERROR: Job failed: exit status 1
failed
VS2015-32-bit-shared-no-apps Build
Which is: 3
The number of loaded edges is not correct!
E:\gitlab\builds\2dad8761\0\OpenMesh\OpenMesh\src\Unittests\unittests_read_write_OM.cc(174): error: Value of: mesh.n_faces()
Actual: 0
Expected: 1u
Which is: 1
The number of loaded faces is not correct!
Assertion failed: size_t(_idx) < data_.size(), file E:\gitlab\builds\2dad8761\0\OpenMesh\OpenMesh\src\OpenMesh/Core/Utils/Property.hh, line 195
ERROR: Job failed: exit status 3
failed
VS2015-32-bit-shared-apps Build
Which is: 3
The number of loaded edges is not correct!
E:\gitlab\builds\7949bd93\0\OpenMesh\OpenMesh\src\Unittests\unittests_read_write_OM.cc(174): error: Value of: mesh.n_faces()
Actual: 0
Expected: 1u
Which is: 1
The number of loaded faces is not correct!
Assertion failed: size_t(_idx) < data_.size(), file E:\gitlab\builds\7949bd93\0\OpenMesh\OpenMesh\src\OpenMesh/Core/Utils/Property.hh, line 195
ERROR: Job failed: exit status 3
failed
VS2015-64-bit-shared-no-apps Build
Which is: 3
The number of loaded edges is not correct!
E:\gitlab\builds\281b716d\0\OpenMesh\OpenMesh\src\Unittests\unittests_read_write_OM.cc(174): error: Value of: mesh.n_faces()
Actual: 0
Expected: 1u
Which is: 1
The number of loaded faces is not correct!
Assertion failed: size_t(_idx) < data_.size(), file E:\gitlab\builds\281b716d\0\OpenMesh\OpenMesh\src\OpenMesh/Core/Utils/Property.hh, line 195
ERROR: Job failed: exit status 3
failed
VS2015-64-bit-shared-apps Build
Which is: 3
The number of loaded edges is not correct!
E:\gitlab\builds\1900f1de\0\OpenMesh\OpenMesh\src\Unittests\unittests_read_write_OM.cc(174): error: Value of: mesh.n_faces()
Actual: 0
Expected: 1u
Which is: 1
The number of loaded faces is not correct!
Assertion failed: size_t(_idx) < data_.size(), file E:\gitlab\builds\1900f1de\0\OpenMesh\OpenMesh\src\OpenMesh/Core/Utils/Property.hh, line 195
ERROR: Job failed: exit status 3
failed
VS2017-32-bit-shared-no-apps Build
The number of loaded edges is not correct!
e:\gitlab\builds\9d73ae51\0\openmesh\openmesh\src\unittests\unittests_read_write_om.cc(174): error: Expected equality of these values:
1u
Which is: 1
mesh.n_faces()
Which is: 0
The number of loaded faces is not correct!
Assertion failed: size_t(_idx) < data_.size(), file e:\gitlab\builds\9d73ae51\0\openmesh\openmesh\src\openmesh\core\utils\property.hh, line 195
ERROR: Job failed: exit status 3
failed
VS2017-64-bit-shared-no-apps Build
The number of loaded edges is not correct!
e:\gitlab\builds\9d73ae51\0\openmesh\openmesh\src\unittests\unittests_read_write_om.cc(174): error: Expected equality of these values:
1u
Which is: 1
mesh.n_faces()
Which is: 0
The number of loaded faces is not correct!
Assertion failed: size_t(_idx) < data_.size(), file e:\gitlab\builds\9d73ae51\0\openmesh\openmesh\src\openmesh\core\utils\property.hh, line 195
ERROR: Job failed: exit status 3
failed
clang-c++14 Build
Error: attempt to subscript container with out-of-bounds index 0, but 
container only holds 0 elements.

Objects involved in the operation:
sequence "this" @ 0x0x17616d0 {
type = std::__debug::vector<OpenMesh::VectorT<float, 3>, std::allocator<OpenMesh::VectorT<float, 3> > >;
}
CI/ci-linux.sh: line 97: 15791 Aborted ./unittests --gtest_color=yes --gtest_output=xml
ERROR: Job failed: exit status 1
failed
macos-c++98 Build
The number of loaded edges is not correct!
/Users/jenkins/builds/b72f60fc/0/OpenMesh/OpenMesh/src/Unittests/unittests_read_write_OM.cc:174: Failure
Value of: mesh.n_faces()
Actual: 0
Expected: 1u
Which is: 1
The number of loaded faces is not correct!
CI/ci-mac.sh: line 79: 64602 Segmentation fault: 11 ./unittests --gtest_color=yes --gtest_output=xml
ERROR: Job failed: exit status 1
failed
VS2017-64-bit-shared-apps Build
The number of loaded edges is not correct!
e:\gitlab\builds\9d73ae51\0\openmesh\openmesh\src\unittests\unittests_read_write_om.cc(174): error: Expected equality of these values:
1u
Which is: 1
mesh.n_faces()
Which is: 0
The number of loaded faces is not correct!
Assertion failed: size_t(_idx) < data_.size(), file e:\gitlab\builds\9d73ae51\0\openmesh\openmesh\src\openmesh\core\utils\property.hh, line 195
ERROR: Job failed: exit status 3
failed
clang-c++11 Build
Error: attempt to subscript container with out-of-bounds index 0, but 
container only holds 0 elements.

Objects involved in the operation:
sequence "this" @ 0x0x1a8cb50 {
type = std::__debug::vector<OpenMesh::VectorT<float, 3>, std::allocator<OpenMesh::VectorT<float, 3> > >;
}
CI/ci-linux.sh: line 97: 53936 Aborted ./unittests --gtest_color=yes --gtest_output=xml
ERROR: Job failed: exit status 1
failed
macos-c++11 Build
The number of loaded edges is not correct!
/Users/jenkins/builds/8dfb9a4a/0/OpenMesh/OpenMesh/src/Unittests/unittests_read_write_OM.cc:174: Failure
Value of: mesh.n_faces()
Actual: 0
Expected: 1u
Which is: 1
The number of loaded faces is not correct!
CI/ci-mac.sh: line 79: 68030 Segmentation fault: 11 ./unittests --gtest_color=yes --gtest_output=xml
ERROR: Job failed: exit status 1
failed
gcc-c++11 Build
Error: attempt to subscript container with out-of-bounds index 0, but 
container only holds 0 elements.

Objects involved in the operation:
sequence "this" @ 0x0x56236e3d7100 {
type = std::__debug::vector<OpenMesh::VectorT<float, 3>, std::allocator<OpenMesh::VectorT<float, 3> > >;
}
CI/ci-linux.sh: line 97: 87869 Aborted ./unittests --gtest_color=yes --gtest_output=xml
ERROR: Job failed: exit status 1
failed
gcc-c++14 Build
Error: attempt to subscript container with out-of-bounds index 0, but 
container only holds 0 elements.

Objects involved in the operation:
sequence "this" @ 0x0x55734ab8c100 {
type = std::__debug::vector<OpenMesh::VectorT<float, 3>, std::allocator<OpenMesh::VectorT<float, 3> > >;
}
CI/ci-linux.sh: line 97: 19612 Aborted ./unittests --gtest_color=yes --gtest_output=xml
ERROR: Job failed: exit status 1
failed
cppcheck Build

==============================================================================
CPPCHECK Summary
==============================================================================


Total CPPCHECK error Count is 2, which is too High (max is 0)! CPPCHECK Run failed

ERROR: Job failed: exit status 1