Use Qt5 files from OpenFlipper

31 jobs for VS2017_Apps-64 in 61 minutes and 4 seconds (queued for 4 seconds)
Status Job ID Name Coverage
  Test
passed #51543
VS2013
VS2013-32-bit-shared-apps

00:04:40

passed #51544
VS2013
VS2013-32-bit-shared-no-apps

00:04:04

passed #51547
VS2013
VS2013-32-bit-static-apps

00:04:38

passed #51548
VS2013
VS2013-32-bit-static-no-apps

00:04:12

passed #51541
VS2013
VS2013-64-bit-shared-apps

00:05:07

passed #51542
VS2013
VS2013-64-bit-shared-no-apps

00:04:26

passed #51545
VS2013
VS2013-64-bit-static-apps

00:05:14

passed #51546
VS2013
VS2013-64-bit-static-no-apps

00:04:40

passed #51535
VS2015
VS2015-32-bit-shared-apps

00:05:40

passed #51536
VS2015
VS2015-32-bit-shared-no-apps

00:05:13

passed #51539
VS2015
VS2015-32-bit-static-apps

00:05:42

passed #51540
VS2015
VS2015-32-bit-static-no-apps

00:05:38

passed #51533
VS2015
VS2015-64-bit-shared-apps

00:06:24

passed #51534
VS2015
VS2015-64-bit-shared-no-apps

00:15:48

passed #51537
VS2015
VS2015-64-bit-static-apps

00:06:24

passed #51538
VS2015
VS2015-64-bit-static-no-apps

00:06:23

failed #51525
Qt5101 VS2017
VS2017-32-bit-shared-apps

00:05:15

passed #51530
VS2017
VS2017-32-bit-shared-no-apps

00:05:38

failed #51526
Qt5101 VS2017
VS2017-32-bit-static-apps

00:06:10

passed #51532
VS2017
VS2017-32-bit-static-no-apps

00:04:54

failed #51527
Qt5101 VS2017
VS2017-64-bit-shared-apps

00:03:15

passed #51529
VS2017
VS2017-64-bit-shared-no-apps

00:05:31

failed #51528
Qt5101 VS2017
VS2017-64-bit-static-apps

00:03:46

passed #51531
VS2017
VS2017-64-bit-static-no-apps

00:08:25

passed #51519
Linux
clang-c++11

00:16:04

passed #51521
Linux
clang-c++14

00:23:49

passed #51524
Linux
cppcheck

00:00:08

passed #51518
Linux
gcc-c++11

00:02:57

passed #51520
Linux
gcc-c++14

00:02:17

passed #51522
Apple
macos-c++11

00:16:01

passed #51523
Apple
macos-c++98

00:09:03

 
Name Stage Failure
failed
VS2017-64-bit-static-apps Test
17>:cmDone
17>if %errorlevel% neq 0 goto :VCEnd
17>:VCEnd
17>Done building project "unittests.vcxproj".
19>------ Build started: Project: ALL_BUILD, Configuration: Release x64 ------
19>Building Custom Rule E:/gitlab/builds/1900f1de/0/OpenMesh/OpenMesh/CMakeLists.txt
19>CMake does not need to re-run because E:/gitlab/builds/1900f1de/0/OpenMesh/OpenMesh/build-release/CMakeFiles/generate.stamp is up-to-date.
========== Build: 14 succeeded, 5 failed, 0 up-to-date, 0 skipped ==========
ERROR: Job failed: exit status 1
failed
VS2017-32-bit-static-apps Test
4>C:\Program Files (x86)\Microsoft Visual Studio\2017\Professional\Common7\IDE\VC\VCTargets\Microsoft.CppCommon.targets(133,5): error MSB3073: endlocal & call :cmErrorLevel %errorlevel% & goto :cmDone
4>C:\Program Files (x86)\Microsoft Visual Studio\2017\Professional\Common7\IDE\VC\VCTargets\Microsoft.CppCommon.targets(133,5): error MSB3073: :cmErrorLevel
4>C:\Program Files (x86)\Microsoft Visual Studio\2017\Professional\Common7\IDE\VC\VCTargets\Microsoft.CppCommon.targets(133,5): error MSB3073: exit /b %1
4>C:\Program Files (x86)\Microsoft Visual Studio\2017\Professional\Common7\IDE\VC\VCTargets\Microsoft.CppCommon.targets(133,5): error MSB3073: :cmDone
4>C:\Program Files (x86)\Microsoft Visual Studio\2017\Professional\Common7\IDE\VC\VCTargets\Microsoft.CppCommon.targets(133,5): error MSB3073: if %errorlevel% neq 0 goto :VCEnd
4>C:\Program Files (x86)\Microsoft Visual Studio\2017\Professional\Common7\IDE\VC\VCTargets\Microsoft.CppCommon.targets(133,5): error MSB3073: :VCEnd" exited with code 1.
4>Done building project "PACKAGE.vcxproj" -- FAILED.
========== Build: 3 succeeded, 1 failed, 11 up-to-date, 0 skipped ==========
ERROR: Job failed: exit status 1
failed
VS2017-32-bit-shared-apps Test
4>C:\Program Files (x86)\Microsoft Visual Studio\2017\Professional\Common7\IDE\VC\VCTargets\Microsoft.CppCommon.targets(133,5): error MSB3073: endlocal & call :cmErrorLevel %errorlevel% & goto :cmDone
4>C:\Program Files (x86)\Microsoft Visual Studio\2017\Professional\Common7\IDE\VC\VCTargets\Microsoft.CppCommon.targets(133,5): error MSB3073: :cmErrorLevel
4>C:\Program Files (x86)\Microsoft Visual Studio\2017\Professional\Common7\IDE\VC\VCTargets\Microsoft.CppCommon.targets(133,5): error MSB3073: exit /b %1
4>C:\Program Files (x86)\Microsoft Visual Studio\2017\Professional\Common7\IDE\VC\VCTargets\Microsoft.CppCommon.targets(133,5): error MSB3073: :cmDone
4>C:\Program Files (x86)\Microsoft Visual Studio\2017\Professional\Common7\IDE\VC\VCTargets\Microsoft.CppCommon.targets(133,5): error MSB3073: if %errorlevel% neq 0 goto :VCEnd
4>C:\Program Files (x86)\Microsoft Visual Studio\2017\Professional\Common7\IDE\VC\VCTargets\Microsoft.CppCommon.targets(133,5): error MSB3073: :VCEnd" exited with code 1.
4>Done building project "PACKAGE.vcxproj" -- FAILED.
========== Build: 3 succeeded, 1 failed, 11 up-to-date, 0 skipped ==========
ERROR: Job failed: exit status 1
failed
VS2017-64-bit-shared-apps Test
18>-- fixup_bundle: done
18>Building Custom Rule E:/gitlab/builds/7949bd93/0/OpenMesh/OpenMesh/CMakeLists.txt
18>CMake does not need to re-run because E:/gitlab/builds/7949bd93/0/OpenMesh/OpenMesh/build-release/CMakeFiles/generate.stamp is up-to-date.
18>Done building project "fixbundle.vcxproj".
19>------ Build started: Project: ALL_BUILD, Configuration: Release x64 ------
19>Building Custom Rule E:/gitlab/builds/7949bd93/0/OpenMesh/OpenMesh/CMakeLists.txt
19>CMake does not need to re-run because E:/gitlab/builds/7949bd93/0/OpenMesh/OpenMesh/build-release/CMakeFiles/generate.stamp is up-to-date.
========== Build: 14 succeeded, 5 failed, 0 up-to-date, 0 skipped ==========
ERROR: Job failed: exit status 1