does pipeline pass without unittest checked?

23 jobs for 15-create-a-more-usefull-example-for-the-mesh-decimater in 13 minutes and 29 seconds (queued for 1 second)
Status Job ID Name Coverage
  Test
canceled #28716
VS2013
VS2013-32-bit-shared-apps

canceled #28717
VS2013
VS2013-32-bit-shared-no-apps

canceled #28720
VS2013
VS2013-32-bit-static-apps

canceled #28721
VS2013
VS2013-32-bit-static-no-apps

canceled #28714
VS2013
VS2013-64-bit-shared-apps

canceled #28715
VS2013
VS2013-64-bit-shared-no-apps

canceled #28718
VS2013
VS2013-64-bit-static-apps

canceled #28719
VS2013
VS2013-64-bit-static-no-apps

canceled #28708
VS2015
VS2015-32-bit-shared-apps

canceled #28709
VS2015
VS2015-32-bit-shared-no-apps

canceled #28712
VS2015
VS2015-32-bit-static-apps

failed #28713
VS2015
VS2015-32-bit-static-no-apps

00:04:06

failed #28706
VS2015
VS2015-64-bit-shared-apps

00:05:19

canceled #28707
VS2015
VS2015-64-bit-shared-no-apps

00:04:03

canceled #28710
VS2015
VS2015-64-bit-static-apps

canceled #28711
VS2015
VS2015-64-bit-static-no-apps

canceled #28700
Linux
clang-c++11

00:13:29

failed #28702
Linux
clang-c++98

00:07:24

failed #28705
Linux
cppcheck

00:01:57

failed #28699
Linux
gcc-c++11

00:01:03

failed #28701
Linux
gcc-c++98

00:01:17

failed #28703
Apple
macos-c++11

00:04:09

failed #28704
Apple
macos-c++98

00:03:52

 
Name Stage Failure
failed
VS2015-32-bit-static-no-apps Test There is an unknown failure, please try again
[ RUN      ] OpenMeshDocDecimater.DecimateEdgeLength
[ OK ] OpenMeshDocDecimater.DecimateEdgeLength (1 ms)
[ RUN ] OpenMeshDocDecimater.DecimateHausdorff
Mesh has no face normals. Compute them automatically.
Mesh has no face normals. Compute them automatically.
[ OK ] OpenMeshDocDecimater.DecimateHausdorff (2 ms)
[ RUN ] OpenMeshDocDecimater.DecimateIndependent
Assertion failed: is_valid_handle(_vh), file E:\gitlab\builds\7949bd93\0\OpenMesh\OpenMesh\src\OpenMesh/Core/Mesh/ArrayKernel.hh, line 147
ERROR: Job failed: exit status 3
failed
VS2015-64-bit-shared-apps Test There is an unknown failure, please try again
[ RUN      ] OpenMeshDocDecimater.DecimateEdgeLength
[ OK ] OpenMeshDocDecimater.DecimateEdgeLength (1 ms)
[ RUN ] OpenMeshDocDecimater.DecimateHausdorff
Mesh has no face normals. Compute them automatically.
Mesh has no face normals. Compute them automatically.
[ OK ] OpenMeshDocDecimater.DecimateHausdorff (2 ms)
[ RUN ] OpenMeshDocDecimater.DecimateIndependent
Assertion failed: is_valid_handle(_vh), file E:\gitlab\builds\1900f1de\0\OpenMesh\OpenMesh\src\OpenMesh/Core/Mesh/ArrayKernel.hh, line 147
ERROR: Job failed: exit status 3
failed
cppcheck Test There is an unknown failure, please try again

==============================================================================
CPPCHECK Summary
==============================================================================


Total CPPCHECK error Count is 19, which is too High! CPPCHECK Run failed

ERROR: Job failed: exit status 1
failed
macos-c++98 Test There is an unknown failure, please try again

[----------] Global test environment tear-down
[==========] 191 tests from 53 test cases ran. (2565 ms total)
[ PASSED ] 190 tests.
[ FAILED ] 1 test, listed below:
[ FAILED ] OpenMeshDocDecimater.DecimateIndependent

1 FAILED TEST
ERROR: Job failed: exit status 1
failed
macos-c++11 Test There is an unknown failure, please try again
[ RUN      ] OpenMeshDocDecimater.DecimateEdgeLength
[ OK ] OpenMeshDocDecimater.DecimateEdgeLength (0 ms)
[ RUN ] OpenMeshDocDecimater.DecimateHausdorff
Mesh has no face normals. Compute them automatically.
Mesh has no face normals. Compute them automatically.
[ OK ] OpenMeshDocDecimater.DecimateHausdorff (1 ms)
[ RUN ] OpenMeshDocDecimater.DecimateIndependent
CI/ci-mac.sh: line 75: 85567 Segmentation fault: 11 ./unittests --gtest_color=yes --gtest_output=xml
ERROR: Job failed: exit status 1
failed
clang-c++98 Test There is an unknown failure, please try again
                                                                  ^
1 error generated.
src/Unittests/CMakeFiles/unittests.dir/build.make:422: recipe for target 'src/Unittests/CMakeFiles/unittests.dir/unittests_property.cc.o' failed
make[2]: *** [src/Unittests/CMakeFiles/unittests.dir/unittests_property.cc.o] Error 1
CMakeFiles/Makefile2:1088: recipe for target 'src/Unittests/CMakeFiles/unittests.dir/all' failed
make[1]: *** [src/Unittests/CMakeFiles/unittests.dir/all] Error 2
Makefile:149: recipe for target 'all' failed
make: *** [all] Error 2
ERROR: Job failed: exit status 1
failed
gcc-c++98 Test There is an unknown failure, please try again
/usr/bin/ld: final link failed: Nonrepresentable section on output
collect2: error: ld returned 1 exit status
src/Unittests/CMakeFiles/unittests.dir/build.make:1320: recipe for target 'Unittests/unittests' failed
make[2]: *** [Unittests/unittests] Error 1
CMakeFiles/Makefile2:1088: recipe for target 'src/Unittests/CMakeFiles/unittests.dir/all' failed
make[1]: *** [src/Unittests/CMakeFiles/unittests.dir/all] Error 2
Makefile:149: recipe for target 'all' failed
make: *** [all] Error 2
ERROR: Job failed: exit status 1
failed
gcc-c++11 Test There is an unknown failure, please try again
/usr/bin/ld: final link failed: Nonrepresentable section on output
collect2: error: ld returned 1 exit status
src/Unittests/CMakeFiles/unittests.dir/build.make:1320: recipe for target 'Unittests/unittests' failed
make[2]: *** [Unittests/unittests] Error 1
CMakeFiles/Makefile2:1088: recipe for target 'src/Unittests/CMakeFiles/unittests.dir/all' failed
make[1]: *** [src/Unittests/CMakeFiles/unittests.dir/all] Error 2
Makefile:149: recipe for target 'all' failed
make: *** [all] Error 2
ERROR: Job failed: exit status 1