more C++98 compatibility

23 jobs for midpoint-subdivision in 76 minutes and 13 seconds (queued for 2 seconds)
Status Job ID Name Coverage
  Test
passed #21693
VS2013
VS2013-32-bit-shared-apps

00:04:55

passed #21694
VS2013
VS2013-32-bit-shared-no-apps

00:03:26

passed #21697
VS2013
VS2013-32-bit-static-apps

00:04:53

passed #21698
VS2013
VS2013-32-bit-static-no-apps

00:03:33

passed #21691
VS2013
VS2013-64-bit-shared-apps

00:04:53

passed #21692
VS2013
VS2013-64-bit-shared-no-apps

00:03:56

passed #21695
VS2013
VS2013-64-bit-static-apps

00:04:53

passed #21696
VS2013
VS2013-64-bit-static-no-apps

00:04:08

passed #21685
VS2015
VS2015-32-bit-shared-apps

00:06:10

passed #21686
VS2015
VS2015-32-bit-shared-no-apps

00:04:33

passed #21689
VS2015
VS2015-32-bit-static-apps

00:05:39

passed #21690
VS2015
VS2015-32-bit-static-no-apps

00:04:56

passed #21683
VS2015
VS2015-64-bit-shared-apps

00:06:35

passed #21684
VS2015
VS2015-64-bit-shared-no-apps

00:05:27

passed #21687
VS2015
VS2015-64-bit-static-apps

00:06:27

passed #21688
VS2015
VS2015-64-bit-static-no-apps

00:05:39

passed #21677
Linux
clang-c++11

00:21:11

failed #21679
Linux
clang-c++98

00:01:33

passed #21682
Linux
cppcheck

00:00:26

passed #21676
Linux
gcc-c++11

00:06:58

failed #21678
Linux
gcc-c++98

00:00:30

passed #21680
Apple
macos-c++11

00:09:35

passed #21681
Apple
macos-c++98

00:08:57

 
Name Stage Failure
failed
clang-c++98 Test There is an unknown failure, please try again
                                          ^
2 errors generated.
src/OpenMesh/Apps/Subdivider/commandlineSubdivider/CMakeFiles/commandlineSubdivider.dir/build.make:62: recipe for target 'src/OpenMesh/Apps/Subdivider/commandlineSubdivider/CMakeFiles/commandlineSubdivider.dir/__/subdivider.cc.o' failed
make[2]: *** [src/OpenMesh/Apps/Subdivider/commandlineSubdivider/CMakeFiles/commandlineSubdivider.dir/__/subdivider.cc.o] Error 1
CMakeFiles/Makefile2:528: recipe for target 'src/OpenMesh/Apps/Subdivider/commandlineSubdivider/CMakeFiles/commandlineSubdivider.dir/all' failed
make[1]: *** [src/OpenMesh/Apps/Subdivider/commandlineSubdivider/CMakeFiles/commandlineSubdivider.dir/all] Error 2
Makefile:149: recipe for target 'all' failed
make: *** [all] Error 2
ERROR: Build failed: exit status 1
failed
gcc-c++98 Test There is an unknown failure, please try again
[ 71%] Built target Synthesizer
[ 71%] Built target ProgViewer
CMakeFiles/Makefile2:920: recipe for target 'src/OpenMesh/Apps/Subdivider/SubdividerGui/CMakeFiles/SubdividerGui.dir/all' failed
make[1]: *** [src/OpenMesh/Apps/Subdivider/SubdividerGui/CMakeFiles/SubdividerGui.dir/all] Error 2
[ 71%] Linking CXX executable ../../../../../Build/bin/DecimaterGui
[ 71%] Built target DecimaterGui
Makefile:149: recipe for target 'all' failed
make: *** [all] Error 2
ERROR: Build failed: exit status 1