attempt to quench 'Checked Iterator' warnings in VS2015

37 jobs for checked-iterators-fix in 44 minutes and 16 seconds (queued for 1 second)
Status Job ID Name Coverage
  Test
canceled #16811
VS2013
VS2013-32-bit-shared-apps

passed #16797
VS2013
VS2013-32-bit-shared-no-apps

00:03:36

canceled #16809
VS2013
VS2013-32-bit-static-apps

00:00:10

passed #16801
VS2013
VS2013-32-bit-static-no-apps

00:03:58

passed #16794
VS2013
VS2013-64-bit-shared-apps

00:05:09

passed #16795
VS2013
VS2013-64-bit-shared-no-apps

00:03:57

canceled #16810
VS2013
VS2013-64-bit-static-apps

passed #16799
VS2013
VS2013-64-bit-static-no-apps

00:04:15

canceled #16817
VS2015
VS2015-32-bit-shared-apps

canceled #16819
VS2015
VS2015-32-bit-shared-no-apps

canceled #16812
VS2015
VS2015-32-bit-static-apps

canceled #16813
VS2015
VS2015-32-bit-static-no-apps

canceled #16821
VS2015
VS2015-64-bit-shared-apps

canceled #16822
VS2015
VS2015-64-bit-shared-no-apps

canceled #16815
VS2015
VS2015-64-bit-static-apps

canceled #16816
VS2015
VS2015-64-bit-static-no-apps

failed #16818
Linux
clang-c++11

00:10:23

passed #16782
Linux
clang-c++98

00:16:41

passed #16785
Linux
cppcheck

00:00:26

failed #16814
Linux
gcc-c++11

00:01:23

passed #16781
Linux
gcc-c++98

00:06:43

failed #16820
Apple
macos-c++11

00:06:58

passed #16784
Apple
macos-c++98

00:15:26

failed #16796
VS2013
VS2013-32-bit-shared-apps

00:03:49

failed #16800
VS2013
VS2013-32-bit-static-apps

00:04:11

failed #16798
VS2013
VS2013-64-bit-static-apps

00:04:10

failed #16788
VS2015
VS2015-32-bit-shared-apps

00:04:40

failed #16789
VS2015
VS2015-32-bit-shared-no-apps

00:03:36

failed #16792
VS2015
VS2015-32-bit-static-apps

00:04:21

failed #16793
VS2015
VS2015-32-bit-static-no-apps

00:03:37

failed #16786
VS2015
VS2015-64-bit-shared-apps

00:04:28

failed #16787
VS2015
VS2015-64-bit-shared-no-apps

00:03:48

failed #16790
VS2015
VS2015-64-bit-static-apps

00:04:36

failed #16791
VS2015
VS2015-64-bit-static-no-apps

00:03:51

failed #16780
Linux
clang-c++11

00:10:22

failed #16779
Linux
gcc-c++11

00:15:02

failed #16783
Apple
macos-c++11

00:06:58

 
Name Stage Failure
failed
macos-c++11 Test There is an unknown failure, please try again
[  PASSED  ] 185 tests.
[ FAILED ] 3 tests, listed below:
[ FAILED ] OpenMesh_Triangle.cpp11_initializer_test
[ FAILED ] OpenMeshOthers.CalcDihedralAngre
[ FAILED ] OpenMeshVectorTest.BasicLinearAlgebra

3 FAILED TESTS

ERROR: Build failed: exit status 1
failed
clang-c++11 Test There is an unknown failure, please try again
[==========] 188 tests from 52 test cases ran. (7036 ms total)
[ PASSED ] 185 tests.
[ FAILED ] 3 tests, listed below:
[ FAILED ] OpenMeshVectorTest.BasicLinearAlgebra
[ FAILED ] OpenMesh_Triangle.cpp11_initializer_test
[ FAILED ] OpenMeshOthers.CalcDihedralAngre

3 FAILED TESTS
ERROR: Build failed: exit status 1
failed
gcc-c++11 Test There is an unknown failure, please try again
[==========] 188 tests from 52 test cases ran. (5556 ms total)
[ PASSED ] 185 tests.
[ FAILED ] 3 tests, listed below:
[ FAILED ] OpenMesh_Triangle.cpp11_initializer_test
[ FAILED ] OpenMeshVectorTest.BasicLinearAlgebra
[ FAILED ] OpenMeshOthers.CalcDihedralAngre

3 FAILED TESTS
ERROR: Build failed: exit status 1