Next bunch of warning fixes

23 jobs for warnings in 7 minutes and 15 seconds (queued for 2 seconds)
Status Job ID Name Coverage
  Test
canceled #16240
VS2013
VS2013-32-bit-shared-apps

canceled #16241
VS2013
VS2013-32-bit-shared-no-apps

canceled #16244
VS2013
VS2013-32-bit-static-apps

canceled #16245
VS2013
VS2013-32-bit-static-no-apps

canceled #16238
VS2013
VS2013-64-bit-shared-apps

canceled #16239
VS2013
VS2013-64-bit-shared-no-apps

canceled #16242
VS2013
VS2013-64-bit-static-apps

canceled #16243
VS2013
VS2013-64-bit-static-no-apps

canceled #16232
VS2015
VS2015-32-bit-shared-apps

canceled #16233
VS2015
VS2015-32-bit-shared-no-apps

canceled #16236
VS2015
VS2015-32-bit-static-apps

canceled #16237
VS2015
VS2015-32-bit-static-no-apps

canceled #16230
VS2015
VS2015-64-bit-shared-apps

00:00:03

canceled #16231
VS2015
VS2015-64-bit-shared-no-apps

00:00:02

canceled #16234
VS2015
VS2015-64-bit-static-apps

canceled #16235
VS2015
VS2015-64-bit-static-no-apps

failed #16224
Linux
clang-c++11

00:02:13

failed #16226
Linux
clang-c++98

00:01:44

passed #16229
Linux
cppcheck

00:00:26

failed #16223
Linux
gcc-c++11

00:00:49

canceled #16225
Linux
gcc-c++98

00:07:15

failed #16227
Apple
macos-c++11

00:01:49

failed #16228
Apple
macos-c++98

00:01:44

 
Name Stage Failure
failed
macos-c++98 Test There is an unknown failure, please try again
    position *= (static_cast<M:Scalar>(1.0) - c);
^~~~~~~~
typename
2 errors generated.
make[2]: *** [src/OpenMesh/Apps/Subdivider/commandlineAdaptiveSubdivider/CMakeFiles/commandlineAdaptiveSubdivider.dir/__/adaptive_subdivider.cc.o] Error 1
make[1]: *** [src/OpenMesh/Apps/Subdivider/commandlineAdaptiveSubdivider/CMakeFiles/commandlineAdaptiveSubdivider.dir/all] Error 2
make: *** [all] Error 2

ERROR: Build failed: exit status 1
failed
macos-c++11 Test There is an unknown failure, please try again
    position *= (static_cast<M:Scalar>(1.0) - c);
^~~~~~~~
typename
2 errors generated.
make[2]: *** [src/OpenMesh/Apps/Subdivider/commandlineAdaptiveSubdivider/CMakeFiles/commandlineAdaptiveSubdivider.dir/__/adaptive_subdivider.cc.o] Error 1
make[1]: *** [src/OpenMesh/Apps/Subdivider/commandlineAdaptiveSubdivider/CMakeFiles/commandlineAdaptiveSubdivider.dir/all] Error 2
make: *** [all] Error 2

ERROR: Build failed: exit status 1
failed
clang-c++98 Test There is an unknown failure, please try again
                             typename 
2 errors generated.
src/OpenMesh/Apps/Subdivider/commandlineAdaptiveSubdivider/CMakeFiles/commandlineAdaptiveSubdivider.dir/build.make:62: recipe for target 'src/OpenMesh/Apps/Subdivider/commandlineAdaptiveSubdivider/CMakeFiles/commandlineAdaptiveSubdivider.dir/__/adaptive_subdivider.cc.o' failed
make[2]: *** [src/OpenMesh/Apps/Subdivider/commandlineAdaptiveSubdivider/CMakeFiles/commandlineAdaptiveSubdivider.dir/__/adaptive_subdivider.cc.o] Error 1
CMakeFiles/Makefile2:584: recipe for target 'src/OpenMesh/Apps/Subdivider/commandlineAdaptiveSubdivider/CMakeFiles/commandlineAdaptiveSubdivider.dir/all' failed
make[1]: *** [src/OpenMesh/Apps/Subdivider/commandlineAdaptiveSubdivider/CMakeFiles/commandlineAdaptiveSubdivider.dir/all] Error 2
Makefile:149: recipe for target 'all' failed
make: *** [all] Error 2
ERROR: Build failed: exit status 1
failed
clang-c++11 Test There is an unknown failure, please try again
                             typename 
2 errors generated.
src/OpenMesh/Apps/Subdivider/commandlineAdaptiveSubdivider/CMakeFiles/commandlineAdaptiveSubdivider.dir/build.make:62: recipe for target 'src/OpenMesh/Apps/Subdivider/commandlineAdaptiveSubdivider/CMakeFiles/commandlineAdaptiveSubdivider.dir/__/adaptive_subdivider.cc.o' failed
make[2]: *** [src/OpenMesh/Apps/Subdivider/commandlineAdaptiveSubdivider/CMakeFiles/commandlineAdaptiveSubdivider.dir/__/adaptive_subdivider.cc.o] Error 1
CMakeFiles/Makefile2:584: recipe for target 'src/OpenMesh/Apps/Subdivider/commandlineAdaptiveSubdivider/CMakeFiles/commandlineAdaptiveSubdivider.dir/all' failed
make[1]: *** [src/OpenMesh/Apps/Subdivider/commandlineAdaptiveSubdivider/CMakeFiles/commandlineAdaptiveSubdivider.dir/all] Error 2
Makefile:149: recipe for target 'all' failed
make: *** [all] Error 2
ERROR: Build failed: exit status 1
failed
gcc-c++11 Test There is an unknown failure, please try again
[ 71%] Linking CXX executable ../../../../Build/bin/QtViewer
[ 71%] Built target QtViewer
[ 71%] Linking CXX executable ../../../../../Build/bin/DecimaterGui
[ 71%] Built target DecimaterGui
CMakeFiles/Makefile2:1088: recipe for target 'src/Unittests/CMakeFiles/unittests.dir/all' failed
make[1]: *** [src/Unittests/CMakeFiles/unittests.dir/all] Error 2
Makefile:149: recipe for target 'all' failed
make: *** [all] Error 2
ERROR: Build failed: exit status 1