Fixed ugly init

23 jobs for warn in 33 minutes and 22 seconds (queued for 3 seconds)
Status Job ID Name Coverage
  Test
failed #14630
VS2013
VS2013-32-bit-shared-apps

00:01:57

passed #14631
VS2013
VS2013-32-bit-shared-no-apps

00:03:50

failed #14634
VS2013
VS2013-32-bit-static-apps

00:01:59

passed #14635
VS2013
VS2013-32-bit-static-no-apps

00:03:57

failed #14628
VS2013
VS2013-64-bit-shared-apps

00:01:37

passed #14629
VS2013
VS2013-64-bit-shared-no-apps

00:03:42

failed #14632
VS2013
VS2013-64-bit-static-apps

00:01:44

passed #14633
VS2013
VS2013-64-bit-static-no-apps

00:03:54

failed #14622
VS2015
VS2015-32-bit-shared-apps

00:02:04

passed #14623
VS2015
VS2015-32-bit-shared-no-apps

00:04:30

failed #14626
VS2015
VS2015-32-bit-static-apps

00:02:36

passed #14627
VS2015
VS2015-32-bit-static-no-apps

00:05:08

failed #14620
VS2015
VS2015-64-bit-shared-apps

00:02:20

passed #14621
VS2015
VS2015-64-bit-shared-no-apps

00:05:40

failed #14624
VS2015
VS2015-64-bit-static-apps

00:02:43

passed #14625
VS2015
VS2015-64-bit-static-no-apps

00:05:22

failed #14614
Linux
clang-c++11

00:02:26

failed #14616
Linux
clang-c++98

00:01:27

passed #14619
Linux
cppcheck

00:00:25

failed #14613
Linux
gcc-c++11

00:00:56

failed #14615
Linux
gcc-c++98

00:00:46

failed #14617
Apple
macos-c++11

00:01:50

failed #14618
Apple
macos-c++98

00:01:50

 
Name Stage Failure
failed
VS2013-32-bit-static-apps Test There is an unknown failure, please try again
19>CustomBuild:
19> Building Custom Rule E:/gitlab/builds/7949bd93/0/OpenMesh/OpenMesh/CMakeLists.txt
19> CMake does not need to re-run because E:\gitlab\builds\7949bd93\0\OpenMesh\OpenMesh\build-release\CMakeFiles\generate.stamp is up-to-date.
19>
19>Build succeeded.
19>
19>Time Elapsed 00:00:00.07
========== Build: 18 succeeded, 1 failed, 0 up-to-date, 0 skipped ==========
ERROR: Build failed: exit status 1
failed
VS2013-64-bit-static-apps Test There is an unknown failure, please try again
19>CustomBuild:
19> Building Custom Rule E:/gitlab/builds/2dad8761/0/OpenMesh/OpenMesh/CMakeLists.txt
19> CMake does not need to re-run because E:\gitlab\builds\2dad8761\0\OpenMesh\OpenMesh\build-release\CMakeFiles\generate.stamp is up-to-date.
19>
19>Build succeeded.
19>
19>Time Elapsed 00:00:00.07
========== Build: 18 succeeded, 1 failed, 0 up-to-date, 0 skipped ==========
ERROR: Build failed: exit status 1
failed
VS2013-32-bit-shared-apps Test There is an unknown failure, please try again
19>CustomBuild:
19> Building Custom Rule E:/gitlab/builds/7949bd93/0/OpenMesh/OpenMesh/CMakeLists.txt
19> CMake does not need to re-run because E:\gitlab\builds\7949bd93\0\OpenMesh\OpenMesh\build-release\CMakeFiles\generate.stamp is up-to-date.
19>
19>Build succeeded.
19>
19>Time Elapsed 00:00:00.07
========== Build: 18 succeeded, 1 failed, 0 up-to-date, 0 skipped ==========
ERROR: Build failed: exit status 1
failed
VS2013-64-bit-shared-apps Test There is an unknown failure, please try again
19>CustomBuild:
19> Building Custom Rule E:/gitlab/builds/2dad8761/0/OpenMesh/OpenMesh/CMakeLists.txt
19> CMake does not need to re-run because E:\gitlab\builds\2dad8761\0\OpenMesh\OpenMesh\build-release\CMakeFiles\generate.stamp is up-to-date.
19>
19>Build succeeded.
19>
19>Time Elapsed 00:00:00.08
========== Build: 18 succeeded, 1 failed, 0 up-to-date, 0 skipped ==========
ERROR: Build failed: exit status 1
failed
VS2015-32-bit-static-apps Test There is an unknown failure, please try again
18>  -- verified='1'
18> -- info=''
18> --
18> -- fixup_bundle: done
19>------ Build started: Project: ALL_BUILD, Configuration: Release Win32 ------
19> Building Custom Rule E:/gitlab/builds/7949bd93/0/OpenMesh/OpenMesh/CMakeLists.txt
19> CMake does not need to re-run because E:\gitlab\builds\7949bd93\0\OpenMesh\OpenMesh\build-release\CMakeFiles\generate.stamp is up-to-date.
========== Build: 18 succeeded, 1 failed, 0 up-to-date, 0 skipped ==========
ERROR: Build failed: exit status 1
failed
VS2015-64-bit-static-apps Test There is an unknown failure, please try again
18>  -- verified='1'
18> -- info=''
18> --
18> -- fixup_bundle: done
19>------ Build started: Project: ALL_BUILD, Configuration: Release x64 ------
19> Building Custom Rule E:/gitlab/builds/1900f1de/0/OpenMesh/OpenMesh/CMakeLists.txt
19> CMake does not need to re-run because E:\gitlab\builds\1900f1de\0\OpenMesh\OpenMesh\build-release\CMakeFiles\generate.stamp is up-to-date.
========== Build: 18 succeeded, 1 failed, 0 up-to-date, 0 skipped ==========
ERROR: Build failed: exit status 1
failed
VS2015-32-bit-shared-apps Test There is an unknown failure, please try again
17>  unittests_vdpm.cc
17> unittests_vector_type.cc
17> Code wird generiert...
17> unittests.vcxproj -> E:\gitlab\builds\281b716d\0\OpenMesh\OpenMesh\build-release\Unittests\unittests.exe
19>------ Erstellen gestartet: Projekt: ALL_BUILD, Konfiguration: Release Win32 ------
19> Building Custom Rule E:/gitlab/builds/281b716d/0/OpenMesh/OpenMesh/CMakeLists.txt
19> CMake does not need to re-run because E:\gitlab\builds\281b716d\0\OpenMesh\OpenMesh\build-release\CMakeFiles\generate.stamp is up-to-date.
========== Erstellen: 18 erfolgreich, 1 fehlerhaft, 0 aktuell, 0 �bersprungen ==========
ERROR: Build failed: exit status 1
failed
VS2015-64-bit-shared-apps Test There is an unknown failure, please try again
18>  -- verified='1'
18> -- info=''
18> --
18> -- fixup_bundle: done
19>------ Erstellen gestartet: Projekt: ALL_BUILD, Konfiguration: Release x64 ------
19> Building Custom Rule E:/gitlab/builds/2dad8761/0/OpenMesh/OpenMesh/CMakeLists.txt
19> CMake does not need to re-run because E:\gitlab\builds\2dad8761\0\OpenMesh\OpenMesh\build-release\CMakeFiles\generate.stamp is up-to-date.
========== Erstellen: 18 erfolgreich, 1 fehlerhaft, 0 aktuell, 0 �bersprungen ==========
ERROR: Build failed: exit status 1
failed
macos-c++98 Test There is an unknown failure, please try again
/Users/jenkins/gitlab-runner/builds/b72f60fc/0/OpenMesh/OpenMesh/src/OpenMesh/Apps/Subdivider/adaptive_subdivider.cc:215:37: error: no member named 'max' in the global namespace
n_iter = std::limits<size_t>::max();
~~^
9 errors generated.
make[2]: *** [src/OpenMesh/Apps/Subdivider/commandlineAdaptiveSubdivider/CMakeFiles/commandlineAdaptiveSubdivider.dir/__/adaptive_subdivider.cc.o] Error 1
make[1]: *** [src/OpenMesh/Apps/Subdivider/commandlineAdaptiveSubdivider/CMakeFiles/commandlineAdaptiveSubdivider.dir/all] Error 2
make: *** [all] Error 2

ERROR: Build failed: exit status 1
failed
macos-c++11 Test There is an unknown failure, please try again
/Users/hudson/gitlab-runner/builds/1a3a3bb2/0/OpenMesh/OpenMesh/src/OpenMesh/Apps/Subdivider/adaptive_subdivider.cc:215:37: error: no member named 'max' in the global namespace
n_iter = std::limits<size_t>::max();
~~^
9 errors generated.
make[2]: *** [src/OpenMesh/Apps/Subdivider/commandlineAdaptiveSubdivider/CMakeFiles/commandlineAdaptiveSubdivider.dir/__/adaptive_subdivider.cc.o] Error 1
make[1]: *** [src/OpenMesh/Apps/Subdivider/commandlineAdaptiveSubdivider/CMakeFiles/commandlineAdaptiveSubdivider.dir/all] Error 2
make: *** [all] Error 2

ERROR: Build failed: exit status 1
failed
clang-c++98 Test There is an unknown failure, please try again
                                  ~~~~~ ^
12 errors generated.
src/OpenMesh/Apps/Subdivider/commandlineAdaptiveSubdivider/CMakeFiles/commandlineAdaptiveSubdivider.dir/build.make:62: recipe for target 'src/OpenMesh/Apps/Subdivider/commandlineAdaptiveSubdivider/CMakeFiles/commandlineAdaptiveSubdivider.dir/__/adaptive_subdivider.cc.o' failed
make[2]: *** [src/OpenMesh/Apps/Subdivider/commandlineAdaptiveSubdivider/CMakeFiles/commandlineAdaptiveSubdivider.dir/__/adaptive_subdivider.cc.o] Error 1
CMakeFiles/Makefile2:584: recipe for target 'src/OpenMesh/Apps/Subdivider/commandlineAdaptiveSubdivider/CMakeFiles/commandlineAdaptiveSubdivider.dir/all' failed
make[1]: *** [src/OpenMesh/Apps/Subdivider/commandlineAdaptiveSubdivider/CMakeFiles/commandlineAdaptiveSubdivider.dir/all] Error 2
Makefile:149: recipe for target 'all' failed
make: *** [all] Error 2
ERROR: Build failed: exit status 1
failed
gcc-c++98 Test There is an unknown failure, please try again
[ 90%] Building CXX object src/Unittests/CMakeFiles/unittests.dir/unittests_trimesh_circulator_face_face.cc.o
[ 91%] Building CXX object src/Unittests/CMakeFiles/unittests.dir/unittests_polymesh_vec2i.cc.o
[ 91%] Building CXX object src/Unittests/CMakeFiles/unittests.dir/unittests_trimesh_circulator_current_halfedge_handle_replacement.cc.o
[ 92%] Building CXX object src/Unittests/CMakeFiles/unittests.dir/unittests_property.cc.o
[ 93%] Linking CXX executable ../../Unittests/unittests
[ 93%] Built target unittests
Makefile:149: recipe for target 'all' failed
make: *** [all] Error 2
ERROR: Build failed: exit status 1
failed
clang-c++11 Test There is an unknown failure, please try again
                                  ~~~~~ ^
12 errors generated.
src/OpenMesh/Apps/Subdivider/commandlineAdaptiveSubdivider/CMakeFiles/commandlineAdaptiveSubdivider.dir/build.make:62: recipe for target 'src/OpenMesh/Apps/Subdivider/commandlineAdaptiveSubdivider/CMakeFiles/commandlineAdaptiveSubdivider.dir/__/adaptive_subdivider.cc.o' failed
make[2]: *** [src/OpenMesh/Apps/Subdivider/commandlineAdaptiveSubdivider/CMakeFiles/commandlineAdaptiveSubdivider.dir/__/adaptive_subdivider.cc.o] Error 1
CMakeFiles/Makefile2:584: recipe for target 'src/OpenMesh/Apps/Subdivider/commandlineAdaptiveSubdivider/CMakeFiles/commandlineAdaptiveSubdivider.dir/all' failed
make[1]: *** [src/OpenMesh/Apps/Subdivider/commandlineAdaptiveSubdivider/CMakeFiles/commandlineAdaptiveSubdivider.dir/all] Error 2
Makefile:149: recipe for target 'all' failed
make: *** [all] Error 2
ERROR: Build failed: exit status 1
failed
gcc-c++11 Test There is an unknown failure, please try again
[ 96%] Building CXX object src/Unittests/CMakeFiles/unittests.dir/unittests_read_write_OFF.cc.o
[ 97%] Building CXX object src/Unittests/CMakeFiles/unittests.dir/unittests_trimesh_circulator_vertex_vertex.cc.o
[ 97%] Building CXX object src/Unittests/CMakeFiles/unittests.dir/unittests_trimesh_collapse.cc.o
[ 98%] Building CXX object src/Unittests/CMakeFiles/unittests.dir/unittests_stripifier.cc.o
[ 99%] Linking CXX executable ../../Unittests/unittests
[ 99%] Built target unittests
Makefile:149: recipe for target 'all' failed
make: *** [all] Error 2
ERROR: Build failed: exit status 1