PropertyManager: Add initializing createIfNotExists() versions.

7 jobs for propmgr in 17 minutes and 48 seconds (queued for 1 second)
Status Job ID Name Coverage
  Test
failed #9847
Linux
clang-c++11

00:07:45

passed #9849
Linux
clang-c++98

00:17:45

passed #9852
Linux
cppcheck

00:00:37

failed #9846
Linux
gcc-c++11

00:01:24

passed #9848
Linux
gcc-c++98

00:04:43

failed #9850
Apple
macos-c++11

00:03:14

passed #9851
Apple
macos-c++98

00:15:24

 
Name Stage Failure
failed
macos-c++11 Test There is an unknown failure, please try again
/Users/hudson/gitlab-runner/builds/1a3a3bb2/0/OpenMesh/OpenMesh/src/Unittests/../OpenMesh/Core/Utils/PropertyManager.hh:407:14: note: candidate function template not viable: requires 3 arguments, but 2 were provided
void set_range(HandleTypeIterator begin, HandleTypeIterator end,
^
6 errors generated.
make[2]: *** [src/Unittests/CMakeFiles/unittests.dir/unittests_propertymanager.cc.o] Error 1
make[1]: *** [src/Unittests/CMakeFiles/unittests.dir/all] Error 2
make: *** [all] Error 2

ERROR: Build failed: exit status 1
failed
clang-c++11 Test There is an unknown failure, please try again
             ^
6 errors generated.
src/Unittests/CMakeFiles/unittests.dir/build.make:734: recipe for target 'src/Unittests/CMakeFiles/unittests.dir/unittests_propertymanager.cc.o' failed
make[2]: *** [src/Unittests/CMakeFiles/unittests.dir/unittests_propertymanager.cc.o] Error 1
CMakeFiles/Makefile2:1088: recipe for target 'src/Unittests/CMakeFiles/unittests.dir/all' failed
make[1]: *** [src/Unittests/CMakeFiles/unittests.dir/all] Error 2
Makefile:149: recipe for target 'all' failed
make: *** [all] Error 2
ERROR: Build failed: exit status 1
failed
gcc-c++11 Test There is an unknown failure, please try again
ICECC[48619] 16:59:30: Compiled on 137.226.115.44
src/Unittests/CMakeFiles/unittests.dir/build.make:734: recipe for target 'src/Unittests/CMakeFiles/unittests.dir/unittests_propertymanager.cc.o' failed
make[2]: *** [src/Unittests/CMakeFiles/unittests.dir/unittests_propertymanager.cc.o] Error 1
make[2]: *** Waiting for unfinished jobs....
CMakeFiles/Makefile2:1088: recipe for target 'src/Unittests/CMakeFiles/unittests.dir/all' failed
make[1]: *** [src/Unittests/CMakeFiles/unittests.dir/all] Error 2
Makefile:149: recipe for target 'all' failed
make: *** [all] Error 2
ERROR: Build failed: exit status 1