Missing escape flag for echo

12 jobs for OM5.1-with-python
Status Job ID Name Coverage
  Test
passed #1308
Linux
clang-c++11

00:18:11

failed #1303
Linux
clang-c++98

00:07:39

passed #1304
Linux
gcc-c++11

00:32:21

failed #1307
Linux
gcc-c++98

00:16:36

failed #1306
Apple
macos-c++11

00:05:01

failed #1305
Apple
macos-c++98

00:04:47

canceled #1292
Linux
clang-c++11

00:00:26

canceled #1295
Linux
clang-c++98

00:00:14

canceled #1291
Linux
gcc-c++11

00:02:12

canceled #1293
Linux
gcc-c++98

00:00:25

canceled #1297
Apple
macos-c++11

canceled #1299
Apple
macos-c++98

 
Name Stage Failure
failed
gcc-c++98 Test There is an unknown failure, please try again
     ^
src/Python/CMakeFiles/openmesh.dir/build.make:54: recipe for target 'src/Python/CMakeFiles/openmesh.dir/Bindings.cc.o' failed
make[2]: *** [src/Python/CMakeFiles/openmesh.dir/Bindings.cc.o] Error 1
CMakeFiles/Makefile2:1124: recipe for target 'src/Python/CMakeFiles/openmesh.dir/all' failed
make[1]: *** [src/Python/CMakeFiles/openmesh.dir/all] Error 2
Makefile:137: recipe for target 'all' failed
make: *** [all] Error 2

ERROR: Build failed with: exit status 1
failed
macos-c++11 Test There is an unknown failure, please try again
test_load_simple_obj_force_vertex_colors_although_not_available (test_read_write_obj.ReadWriteOBJ) ... ok
test_load_simple_obj_with_vertex_colors_after_vertices (test_read_write_obj.ReadWriteOBJ) ... ok
test_load_simple_obj_with_vertex_colors_as_vc_lines (test_read_write_obj.ReadWriteOBJ) ... ok
test_load_simple_off_file (test_read_write_off.ReadWriteOFF) ... ok
test_write_and_read_binary_float_vertex_colors_to_and_from_off_file (test_read_write_off.ReadWriteOFF) ... ok
test_write_and_read_float_vertex_colors_to_and_from_off_file (test_read_write_off.ReadWriteOFF) ... ok
test_write_and_read_vertex_colors_to_and_from_off_file (test_read_write_off.ReadWriteOFF) ... CI/ci-mac.sh: line 98: 6966 Segmentation fault: 11 python -m unittest discover -v

ERROR: Build failed with: exit status 1
failed
macos-c++98 Test There is an unknown failure, please try again
test_load_simple_obj_force_vertex_colors_although_not_available (test_read_write_obj.ReadWriteOBJ) ... ok
test_load_simple_obj_with_vertex_colors_after_vertices (test_read_write_obj.ReadWriteOBJ) ... ok
test_load_simple_obj_with_vertex_colors_as_vc_lines (test_read_write_obj.ReadWriteOBJ) ... ok
test_load_simple_off_file (test_read_write_off.ReadWriteOFF) ... ok
test_write_and_read_binary_float_vertex_colors_to_and_from_off_file (test_read_write_off.ReadWriteOFF) ... ok
test_write_and_read_float_vertex_colors_to_and_from_off_file (test_read_write_off.ReadWriteOFF) ... ok
test_write_and_read_vertex_colors_to_and_from_off_file (test_read_write_off.ReadWriteOFF) ... CI/ci-mac.sh: line 98: 5446 Segmentation fault: 11 python -m unittest discover -v

ERROR: Build failed with: exit status 1
failed
clang-c++98 Test There is an unknown failure, please try again
test_create_strange_config (test_add_face.AddFace) ... PolyMeshT::add_face: patch re-linking failed
ok
test_create_triangle_mesh_cube (test_add_face.AddFace) ... ok
test_property_manager (test_python.Python) ... ok
test_python_circulator (test_python.Python) ... ok
test_python_iterator (test_python.Python) ... ok
test_load_ply_from_mesh_lab_with_vertex_colors (test_read_write_ply.ReadWritePLY) ... CI/ci-linux.sh: line 104: 4271 Segmentation fault python -m unittest discover -v

ERROR: Build failed with: exit status 1