Color output

6 jobs for OM6.0-with-python
Status Job ID Name Coverage
  Test
passed #1280
Linux
clang-c++11

00:19:36

failed #1282
Linux
clang-c++98

00:08:40

passed #1279
Linux
gcc-c++11

00:26:11

failed #1281
Linux
gcc-c++98

00:19:41

passed #1283
Apple
macos-c++11

00:09:04

failed #1284
Apple
macos-c++98

00:04:47

 
Name Stage Failure
failed
macos-c++98 Test There is an unknown failure, please try again
test_load_simple_obj_force_vertex_colors_although_not_available (test_read_write_obj.ReadWriteOBJ) ... ok
test_load_simple_obj_with_vertex_colors_after_vertices (test_read_write_obj.ReadWriteOBJ) ... ok
test_load_simple_obj_with_vertex_colors_as_vc_lines (test_read_write_obj.ReadWriteOBJ) ... ok
test_load_simple_off_file (test_read_write_off.ReadWriteOFF) ... ok
test_write_and_read_binary_float_vertex_colors_to_and_from_off_file (test_read_write_off.ReadWriteOFF) ... ok
test_write_and_read_float_vertex_colors_to_and_from_off_file (test_read_write_off.ReadWriteOFF) ... ok
test_write_and_read_vertex_colors_to_and_from_off_file (test_read_write_off.ReadWriteOFF) ... CI/ci-mac.sh: line 98: 98462 Segmentation fault: 11 python -m unittest discover -v

ERROR: Build failed with: exit status 1
failed
clang-c++98 Test There is an unknown failure, please try again
test_collapse_tetrahedron (test_trimesh_collapse.Collapse) ... ok
test_collapse_tetrahedron_complex (test_trimesh_collapse.Collapse) ... ok
test_large_collapse_halfedge (test_trimesh_collapse.Collapse) ... ok
test_load_simple_off_file (test_read_write_off.ReadWriteOFF) ... ok
test_write_and_read_binary_float_vertex_colors_to_and_from_off_file (test_read_write_off.ReadWriteOFF) ... ok
test_write_and_read_float_vertex_colors_to_and_from_off_file (test_read_write_off.ReadWriteOFF) ... ok
test_write_and_read_vertex_colors_to_and_from_off_file (test_read_write_off.ReadWriteOFF) ... CI/ci-linux.sh: line 104: 4706 Segmentation fault python -m unittest discover -v

ERROR: Build failed with: exit status 1
failed
gcc-c++98 Test There is an unknown failure, please try again
     ^
src/Python/CMakeFiles/openmesh.dir/build.make:54: recipe for target 'src/Python/CMakeFiles/openmesh.dir/Bindings.cc.o' failed
make[2]: *** [src/Python/CMakeFiles/openmesh.dir/Bindings.cc.o] Error 1
CMakeFiles/Makefile2:1124: recipe for target 'src/Python/CMakeFiles/openmesh.dir/all' failed
make[1]: *** [src/Python/CMakeFiles/openmesh.dir/all] Error 2
Makefile:137: recipe for target 'all' failed
make: *** [all] Error 2

ERROR: Build failed with: exit status 1