Fixed VS2015 Update 3 fix

8 jobs for VS2015_Update3 in 2 minutes and 53 seconds (queued for 1 second)
Status Job ID Name Coverage
  Test
failed #6941
Linux
clang-c++11

00:00:37

failed #6943
Linux
clang-c++98

00:00:31

passed #6946
Linux
cppcheck

00:00:26

failed #6947
Linux
gcc-c++11

00:00:11

failed #6942
Linux
gcc-c++98

00:00:10

failed #6944
Apple
macos-c++11

00:00:18

failed #6945
Apple
macos-c++98

00:00:37

failed #6940
Linux
gcc-c++11

00:00:00

 
Name Stage Failure
failed
gcc-c++11 Test There is an unknown failure, please try again
CMakeFiles/Makefile2:119: recipe for target 'src/OpenMesh/Core/CMakeFiles/OpenMeshCore.dir/all' failed
make[1]: *** [src/OpenMesh/Core/CMakeFiles/OpenMeshCore.dir/all] Error 2
make[1]: *** Waiting for unfinished jobs....
CMakeFiles/Makefile2:156: recipe for target 'src/OpenMesh/Core/CMakeFiles/OpenMeshCoreStatic.dir/all' failed
make[1]: *** [src/OpenMesh/Core/CMakeFiles/OpenMeshCoreStatic.dir/all] Error 2
Makefile:149: recipe for target 'all' failed
make: *** [all] Error 2

ERROR: Build failed: exit status 1
failed
macos-c++98 Test There is an unknown failure, please try again
  return HalfedgeIter(*this, HalfedgeHandle(int(n_halfedges())));
^ ~~~~~~~~~~~~~~~~~~~~~~~~~~~~~~~~~~~~
fatal error: too many errors emitted, stopping now [-ferror-limit=]
20 errors generated.
make[2]: *** [src/OpenMesh/Core/CMakeFiles/OpenMeshCore.dir/Mesh/PolyConnectivity.cc.o] Error 1
make[1]: *** [src/OpenMesh/Core/CMakeFiles/OpenMeshCore.dir/all] Error 2
make: *** [all] Error 2

ERROR: Build failed: exit status 1
failed
macos-c++11 Test There is an unknown failure, please try again
  return HalfedgeIter(*this, HalfedgeHandle(int(n_halfedges())));
^ ~~~~~~~~~~~~~~~~~~~~~~~~~~~~~~~~~~~~
fatal error: too many errors emitted, stopping now [-ferror-limit=]
20 errors generated.
make[2]: *** [src/OpenMesh/Core/CMakeFiles/OpenMeshCore.dir/Mesh/PolyConnectivity.cc.o] Error 1
make[1]: *** [src/OpenMesh/Core/CMakeFiles/OpenMeshCore.dir/all] Error 2
make: *** [all] Error 2

ERROR: Build failed: exit status 1
failed
clang-c++98 Test There is an unknown failure, please try again
12 errors generated.
src/OpenMesh/Core/CMakeFiles/OpenMeshCore.dir/build.make:446: recipe for target 'src/OpenMesh/Core/CMakeFiles/OpenMeshCore.dir/Mesh/TriConnectivity.cc.o' failed
make[2]: *** [src/OpenMesh/Core/CMakeFiles/OpenMeshCore.dir/Mesh/TriConnectivity.cc.o] Error 1
CMakeFiles/Makefile2:119: recipe for target 'src/OpenMesh/Core/CMakeFiles/OpenMeshCore.dir/all' failed
make[1]: *** [src/OpenMesh/Core/CMakeFiles/OpenMeshCore.dir/all] Error 2
Makefile:149: recipe for target 'all' failed
make: *** [all] Error 2

ERROR: Build failed: exit status 1
failed
gcc-c++98 Test There is an unknown failure, please try again
CMakeFiles/Makefile2:119: recipe for target 'src/OpenMesh/Core/CMakeFiles/OpenMeshCore.dir/all' failed
make[1]: *** [src/OpenMesh/Core/CMakeFiles/OpenMeshCore.dir/all] Error 2
make[1]: *** Waiting for unfinished jobs....
CMakeFiles/Makefile2:156: recipe for target 'src/OpenMesh/Core/CMakeFiles/OpenMeshCoreStatic.dir/all' failed
make[1]: *** [src/OpenMesh/Core/CMakeFiles/OpenMeshCoreStatic.dir/all] Error 2
Makefile:149: recipe for target 'all' failed
make: *** [all] Error 2

ERROR: Build failed: exit status 1
failed
clang-c++11 Test There is an unknown failure, please try again
12 errors generated.
src/OpenMesh/Core/CMakeFiles/OpenMeshCore.dir/build.make:446: recipe for target 'src/OpenMesh/Core/CMakeFiles/OpenMeshCore.dir/Mesh/TriConnectivity.cc.o' failed
make[2]: *** [src/OpenMesh/Core/CMakeFiles/OpenMeshCore.dir/Mesh/TriConnectivity.cc.o] Error 1
CMakeFiles/Makefile2:119: recipe for target 'src/OpenMesh/Core/CMakeFiles/OpenMeshCore.dir/all' failed
make[1]: *** [src/OpenMesh/Core/CMakeFiles/OpenMeshCore.dir/all] Error 2
Makefile:149: recipe for target 'all' failed
make: *** [all] Error 2

ERROR: Build failed: exit status 1