add property to be able to restore data from file

29 jobs for CustomProperties in 68 minutes and 13 seconds (queued for 4 seconds)
Status Job ID Name Coverage
  Build
failed #114924
Qt5101 VS2015
build-VS2015-x64-shared-FALSE-apps

00:07:02

failed #114925
VS2015
build-VS2015-x64-shared-FALSE-no-apps

00:06:47

failed #114922
Qt5101 VS2015
build-VS2015-x64-shared-TRUE-apps

00:07:37

failed #114923
VS2015
build-VS2015-x64-shared-TRUE-no-apps

00:06:15

failed #114920
Qt5101 VS2017
build-VS2017-x64-shared-FALSE-apps

00:07:43

failed #114921
VS2017
build-VS2017-x64-shared-FALSE-no-apps

00:04:48

failed #114918
Qt5101 VS2017
build-VS2017-x64-shared-TRUE-apps

00:07:02

failed #114919
VS2017
build-VS2017-x64-shared-TRUE-no-apps

00:07:26

passed #114908
Docker
build-debug-clang-cpp11

00:15:02

passed #114912
Docker
build-debug-clang-cpp14

00:13:22

passed #114906
Docker
build-debug-gcc-cpp11

00:04:14

passed #114910
Docker
build-debug-gcc-cpp14

00:03:32

passed #114909
Docker
build-release-clang-cpp11

00:44:19

passed #114913
Docker
build-release-clang-cpp14

00:29:06

passed #114907
Docker
build-release-gcc-cpp11

00:05:45

passed #114911
Docker
build-release-gcc-cpp14

00:05:41

passed #114905
Docker
cppcheck

01:08:11

failed #114914
Apple
macos-cpp11-debug

00:07:57

failed #114915
Apple
macos-cpp11-release

00:25:46

failed #114916
Apple
macos-cpp14-debug

00:07:50

failed #114917
Apple
macos-cpp14-release

00:14:04

 
  Test
failed #114928
Docker
test-debug-clang-cpp11

00:01:51

failed #114932
Docker
test-debug-clang-cpp14

00:01:56

failed #114926
Docker
test-debug-gcc-cpp11

00:01:41

failed #114930
Docker
test-debug-gcc-cpp14

00:01:46

failed #114929
Docker
test-release-clang-cpp11

00:01:03

failed #114933
Docker
test-release-clang-cpp14

00:01:02

failed #114927
Docker
test-release-gcc-cpp11

00:01:21

failed #114931
Docker
test-release-gcc-cpp14

00:01:24

 
Name Stage Failure
failed
test-release-clang-cpp11 Test
 3 FAILED TESTS
Uploading artifacts for failed job
Uploading artifacts...
build-clang-cpp11-release-Vector-Checks/Unittests/report.xml: found 1 matching files and directories

WARNING: build-clang-cpp11-release-Vector-Checks/Unittests/report-customvec.xml: no matching files
WARNING: build-clang-cpp11-release-Vector-Checks/Unittests/report-doublevec.xml: no matching files
Uploading artifacts as "junit" to coordinator... ok
id=114929 responseStatus=201 Created token=4XKzonGt
Cleaning up file based variables
ERROR: Job failed: exit code 1
failed
test-release-clang-cpp14 Test
#bytes written: 1136
Uploading artifacts for failed job
Uploading artifacts...
build-clang-cpp14-release-Vector-Checks/Unittests/report.xml: found 1 matching files and directories

WARNING: build-clang-cpp14-release-Vector-Checks/Unittests/report-customvec.xml: no matching files
WARNING: build-clang-cpp14-release-Vector-Checks/Unittests/report-doublevec.xml: no matching files
Uploading artifacts as "junit" to coordinator... ok
id=114933 responseStatus=201 Created token=ZVzUf81Q
Cleaning up file based variables
ERROR: Job failed: exit code 1
failed
test-debug-clang-cpp14 Test
[ RUN      ] OpenMeshReadWriteOM.LoadTriangleMeshWithPropertiesCurrentVersion
Uploading artifacts for failed job
Uploading artifacts...
WARNING: build-clang-cpp14-debug-Vector-Checks/Unittests/report.xml: no matching files
WARNING: build-clang-cpp14-debug-Vector-Checks/Unittests/report-customvec.xml: no matching files
WARNING: build-clang-cpp14-debug-Vector-Checks/Unittests/report-doublevec.xml: no matching files
ERROR: No files to upload
Cleaning up file based variables
ERROR: Job failed: exit code 1
failed
test-release-gcc-cpp14 Test
#bytes written: 1136
Uploading artifacts for failed job
Uploading artifacts...
build-gcc-cpp14-release-Vector-Checks/Unittests/report.xml: found 1 matching files and directories

WARNING: build-gcc-cpp14-release-Vector-Checks/Unittests/report-customvec.xml: no matching files
WARNING: build-gcc-cpp14-release-Vector-Checks/Unittests/report-doublevec.xml: no matching files
Uploading artifacts as "junit" to coordinator... ok
id=114931 responseStatus=201 Created token=hsXmoy_Q
Cleaning up file based variables
ERROR: Job failed: exit code 1
failed
test-debug-gcc-cpp14 Test
[ RUN      ] OpenMeshReadWriteOM.LoadTriangleMeshWithPropertiesCurrentVersion
Uploading artifacts for failed job
Uploading artifacts...
WARNING: build-gcc-cpp14-debug-Vector-Checks/Unittests/report.xml: no matching files
WARNING: build-gcc-cpp14-debug-Vector-Checks/Unittests/report-customvec.xml: no matching files
WARNING: build-gcc-cpp14-debug-Vector-Checks/Unittests/report-doublevec.xml: no matching files
ERROR: No files to upload
Cleaning up file based variables
ERROR: Job failed: exit code 1
failed
test-debug-clang-cpp11 Test
[ RUN      ] OpenMeshReadWriteOM.LoadTriangleMeshWithPropertiesCurrentVersion
Uploading artifacts for failed job
Uploading artifacts...
WARNING: build-clang-cpp11-debug-Vector-Checks/Unittests/report.xml: no matching files
WARNING: build-clang-cpp11-debug-Vector-Checks/Unittests/report-customvec.xml: no matching files
WARNING: build-clang-cpp11-debug-Vector-Checks/Unittests/report-doublevec.xml: no matching files
ERROR: No files to upload
Cleaning up file based variables
ERROR: Job failed: exit code 1
failed
test-release-gcc-cpp11 Test
 3 FAILED TESTS
Uploading artifacts for failed job
Uploading artifacts...
build-gcc-cpp11-release-Vector-Checks/Unittests/report.xml: found 1 matching files and directories

WARNING: build-gcc-cpp11-release-Vector-Checks/Unittests/report-customvec.xml: no matching files
WARNING: build-gcc-cpp11-release-Vector-Checks/Unittests/report-doublevec.xml: no matching files
Uploading artifacts as "junit" to coordinator... ok
id=114927 responseStatus=201 Created token=ftte4n4d
Cleaning up file based variables
ERROR: Job failed: exit code 1
failed
test-debug-gcc-cpp11 Test
[ RUN      ] OpenMeshReadWriteOM.LoadTriangleMeshWithPropertiesCurrentVersion
Uploading artifacts for failed job
Uploading artifacts...
WARNING: build-gcc-cpp11-debug-Vector-Checks/Unittests/report.xml: no matching files
WARNING: build-gcc-cpp11-debug-Vector-Checks/Unittests/report-customvec.xml: no matching files
WARNING: build-gcc-cpp11-debug-Vector-Checks/Unittests/report-doublevec.xml: no matching files
ERROR: No files to upload
Cleaning up file based variables
ERROR: Job failed: exit code 1
failed
macos-cpp14-release Build
[  FAILED  ] 3 tests, listed below:
[ FAILED ] OpenMeshReadWriteOM.ReadBigMeshWithCustomProperty
[ FAILED ] OpenMeshReadWriteOM.LoadTriangleMeshWithPropertiesVersion_2_1
[ FAILED ] OpenMeshReadWriteOM.LoadTriangleMeshWithPropertiesCurrentVersion

3 FAILED TESTS
Running after_script
Uploading artifacts for failed job
ERROR: Job failed: exit status 1
failed
macos-cpp11-release Build
[  FAILED  ] 3 tests, listed below:
[ FAILED ] OpenMeshReadWriteOM.ReadBigMeshWithCustomProperty
[ FAILED ] OpenMeshReadWriteOM.LoadTriangleMeshWithPropertiesVersion_2_1
[ FAILED ] OpenMeshReadWriteOM.LoadTriangleMeshWithPropertiesCurrentVersion

3 FAILED TESTS
Running after_script
Uploading artifacts for failed job
ERROR: Job failed: exit status 1
failed
build-VS2015-x64-shared-FALSE-no-apps Build
Uploading artifacts...
Runtime platform
arch=amd64 os=windows pid=9128 revision=ece86343 version=13.5.0
build-release/unittests/report.xml: found 1 matching files and directories

build-release/unittests/report-customvec.xml: found 1 matching files and directories

build-release/unittests/report-doublevec.xml: found 1 matching files and directories

WARNING: Failed to load system CertPool: crypto/x509: system root pool is not available on Windows
Uploading artifacts as "junit" to coordinator... ok
id=114925 responseStatus=201 Created token=xSFdELru
Cleaning up file based variables
ERROR: Job failed: exit status 1
failed
build-VS2015-x64-shared-FALSE-apps Build
Uploading artifacts...
Runtime platform
arch=amd64 os=windows pid=10668 revision=ece86343 version=13.5.0
build-release/unittests/report.xml: found 1 matching files and directories

build-release/unittests/report-customvec.xml: found 1 matching files and directories

build-release/unittests/report-doublevec.xml: found 1 matching files and directories

WARNING: Failed to load system CertPool: crypto/x509: system root pool is not available on Windows
Uploading artifacts as "junit" to coordinator... ok
id=114924 responseStatus=201 Created token=bqGG64VZ
Cleaning up file based variables
ERROR: Job failed: exit status 1
failed
macos-cpp14-debug Build
For property Vertex: OM vector of dimension 4 of type unsigned short
[ FAILED ] OpenMeshReadWriteOM.LoadTriangleMeshWithPropertiesVersion_2_1 (4190 ms)
[ RUN ] OpenMeshReadWriteOM.LoadTriangleMeshWithPropertiesCurrentVersion
#bytes written: 25324
Assertion failed: (block_size == b), function restore_binary_custom_data, file /Users/jenkins/builds/8dfb9a4a/0/OpenMesh/OpenMesh/src/OpenMesh/Core/IO/reader/OMReader.cc, line 773.
CI/ci-mac-test.sh: line 43: 17623 Abort trap: 6 ./unittests --gtest_color=yes --gtest_output=xml:./report.xml
Running after_script
Uploading artifacts for failed job
ERROR: Job failed: exit status 1
failed
build-VS2015-x64-shared-TRUE-apps Build
Uploading artifacts...
Runtime platform
arch=amd64 os=windows pid=3000 revision=ece86343 version=13.5.0
build-release/unittests/report.xml: found 1 matching files and directories

build-release/unittests/report-customvec.xml: found 1 matching files and directories

build-release/unittests/report-doublevec.xml: found 1 matching files and directories

WARNING: Failed to load system CertPool: crypto/x509: system root pool is not available on Windows
Uploading artifacts as "junit" to coordinator... ok
id=114922 responseStatus=201 Created token=f1hZxjFw
Cleaning up file based variables
ERROR: Job failed: exit status 1
failed
build-VS2015-x64-shared-TRUE-no-apps Build
Uploading artifacts...
Runtime platform
arch=amd64 os=windows pid=12280 revision=ece86343 version=13.5.0
build-release/unittests/report.xml: found 1 matching files and directories

build-release/unittests/report-customvec.xml: found 1 matching files and directories

build-release/unittests/report-doublevec.xml: found 1 matching files and directories

WARNING: Failed to load system CertPool: crypto/x509: system root pool is not available on Windows
Uploading artifacts as "junit" to coordinator... ok
id=114923 responseStatus=201 Created token=wWMUZx4x
Cleaning up file based variables
ERROR: Job failed: exit status 1
failed
macos-cpp11-debug Build
For property Vertex: OM vector of dimension 4 of type unsigned short
[ FAILED ] OpenMeshReadWriteOM.LoadTriangleMeshWithPropertiesVersion_2_1 (4181 ms)
[ RUN ] OpenMeshReadWriteOM.LoadTriangleMeshWithPropertiesCurrentVersion
#bytes written: 25324
Assertion failed: (block_size == b), function restore_binary_custom_data, file /Users/jenkins/builds/8dfb9a4a/0/OpenMesh/OpenMesh/src/OpenMesh/Core/IO/reader/OMReader.cc, line 773.
CI/ci-mac-test.sh: line 43: 15625 Abort trap: 6 ./unittests --gtest_color=yes --gtest_output=xml:./report.xml
Running after_script
Uploading artifacts for failed job
ERROR: Job failed: exit status 1
failed
build-VS2017-x64-shared-FALSE-apps Build
Uploading artifacts...
Runtime platform
arch=amd64 os=windows pid=4260 revision=ece86343 version=13.5.0
build-release/unittests/report.xml: found 1 matching files and directories

build-release/unittests/report-customvec.xml: found 1 matching files and directories

build-release/unittests/report-doublevec.xml: found 1 matching files and directories

WARNING: Failed to load system CertPool: crypto/x509: system root pool is not available on Windows
Uploading artifacts as "junit" to coordinator... ok
id=114920 responseStatus=201 Created token=mpkD4szs
Cleaning up file based variables
ERROR: Job failed: exit status 1
failed
build-VS2017-x64-shared-TRUE-no-apps Build
Uploading artifacts...
Runtime platform
arch=amd64 os=windows pid=7612 revision=ece86343 version=13.5.0
build-release/unittests/report.xml: found 1 matching files and directories

build-release/unittests/report-customvec.xml: found 1 matching files and directories

build-release/unittests/report-doublevec.xml: found 1 matching files and directories

WARNING: Failed to load system CertPool: crypto/x509: system root pool is not available on Windows
Uploading artifacts as "junit" to coordinator... ok
id=114919 responseStatus=201 Created token=wozoBmMZ
Cleaning up file based variables
ERROR: Job failed: exit status 1
failed
build-VS2017-x64-shared-TRUE-apps Build
Uploading artifacts...
Runtime platform
arch=amd64 os=windows pid=7460 revision=ece86343 version=13.5.0
build-release/unittests/report.xml: found 1 matching files and directories

build-release/unittests/report-customvec.xml: found 1 matching files and directories

build-release/unittests/report-doublevec.xml: found 1 matching files and directories

WARNING: Failed to load system CertPool: crypto/x509: system root pool is not available on Windows
Uploading artifacts as "junit" to coordinator... ok
id=114918 responseStatus=201 Created token=ZxnKp_DD
Cleaning up file based variables
ERROR: Job failed: exit status 1
failed
build-VS2017-x64-shared-FALSE-no-apps Build
Uploading artifacts...
Runtime platform
arch=amd64 os=windows pid=20136 revision=ece86343 version=13.5.0
build-release/unittests/report.xml: found 1 matching files and directories

build-release/unittests/report-customvec.xml: found 1 matching files and directories

build-release/unittests/report-doublevec.xml: found 1 matching files and directories

WARNING: Failed to load system CertPool: crypto/x509: system root pool is not available on Windows
Uploading artifacts as "junit" to coordinator... ok
id=114921 responseStatus=201 Created token=QFBXpuv8
Cleaning up file based variables
ERROR: Job failed: exit status 1