Try to fix float warning

29 jobs for Warning_fixes in 71 minutes and 28 seconds (queued for 36 seconds)
Status Job ID Name Coverage
  Build
failed #109794
Qt5101 VS2015
build-VS2015-x64-shared-FALSE-apps

00:24:33

failed #109795
VS2015
build-VS2015-x64-shared-FALSE-no-apps

00:24:23

failed #109792
Qt5101 VS2015
build-VS2015-x64-shared-TRUE-apps

00:25:21

failed #109793
VS2015
build-VS2015-x64-shared-TRUE-no-apps

00:23:47

failed #109790
Qt5101 VS2017
build-VS2017-x64-shared-FALSE-apps

00:22:06

failed #109791
VS2017
build-VS2017-x64-shared-FALSE-no-apps

00:21:27

failed #109788
Qt5101 VS2017
build-VS2017-x64-shared-TRUE-apps

00:18:30

failed #109789
VS2017
build-VS2017-x64-shared-TRUE-no-apps

00:20:07

passed #109778
Docker
build-debug-clang-cpp11

00:21:00

passed #109782
Docker
build-debug-clang-cpp14

00:19:54

passed #109776
Docker
build-debug-gcc-cpp11

00:03:29

passed #109780
Docker
build-debug-gcc-cpp14

00:04:00

passed #109779
Docker
build-release-clang-cpp11

00:25:24

passed #109783
Docker
build-release-clang-cpp14

00:39:11

passed #109777
Docker
build-release-gcc-cpp11

00:06:15

passed #109781
Docker
build-release-gcc-cpp14

00:06:34

passed #109775
Docker
cppcheck

00:37:16

failed #109784
Apple
macos-cpp11-debug

00:16:25

failed #109785
Apple
macos-cpp11-release

00:12:30

failed #109786
Apple
macos-cpp14-debug

00:09:04

failed #109787
Apple
macos-cpp14-release

00:22:45

 
  Test
failed #109798
Docker
test-debug-clang-cpp11

00:05:23

failed #109802
Docker
test-debug-clang-cpp14

00:04:50

failed #109796
Docker
test-debug-gcc-cpp11

00:04:48

failed #109800
Docker
test-debug-gcc-cpp14

00:05:19

failed #109799
Docker
test-release-clang-cpp11

00:01:22

failed #109803
Docker
test-release-clang-cpp14

00:01:23

failed #109797
Docker
test-release-gcc-cpp11

00:01:27

failed #109801
Docker
test-release-gcc-cpp14

00:01:59

 
Name Stage Failure
failed
build-VS2015-x64-shared-FALSE-no-apps Build
OS/Arch:      windows/amd64
Uploading artifacts...
Runtime platform
arch=amd64 os=windows pid=13708 revision=efa30e33 version=13.2.1
build-release/unittests/report.xml: found 1 matching files and directories

build-release/unittests/report-customvec.xml: found 1 matching files and directories

build-release/unittests/report-doublevec.xml: found 1 matching files and directories

WARNING: Failed to load system CertPool: crypto/x509: system root pool is not available on Windows
Uploading artifacts as "junit" to coordinator... ok
id=109795 responseStatus=201 Created token=R8UwsLvQ
ERROR: Job failed: exit status 1
failed
build-VS2015-x64-shared-FALSE-apps Build
OS/Arch:      windows/amd64
Uploading artifacts...
Runtime platform
arch=amd64 os=windows pid=5324 revision=efa30e33 version=13.2.1
build-release/unittests/report.xml: found 1 matching files and directories

build-release/unittests/report-customvec.xml: found 1 matching files and directories

build-release/unittests/report-doublevec.xml: found 1 matching files and directories

WARNING: Failed to load system CertPool: crypto/x509: system root pool is not available on Windows
Uploading artifacts as "junit" to coordinator... ok
id=109794 responseStatus=201 Created token=5cZyysJa
ERROR: Job failed: exit status 1
failed
test-release-clang-cpp14 Test

2 FAILED TESTS
Uploading artifacts for failed job
Uploading artifacts...
build-clang-cpp14-release-Vector-Checks/Unittests/report.xml: found 1 matching files and directories

build-clang-cpp14-release-Vector-Checks/Unittests/report-customvec.xml: found 1 matching files and directories

build-clang-cpp14-release-Vector-Checks/Unittests/report-doublevec.xml: found 1 matching files and directories

Uploading artifacts as "junit" to coordinator... ok
id=109803 responseStatus=201 Created token=FJxdyepq
ERROR: Job failed: exit code 1
failed
build-VS2015-x64-shared-TRUE-apps Build
OS/Arch:      windows/amd64
Uploading artifacts...
Runtime platform
arch=amd64 os=windows pid=5124 revision=efa30e33 version=13.2.1
build-release/unittests/report.xml: found 1 matching files and directories

build-release/unittests/report-customvec.xml: found 1 matching files and directories

build-release/unittests/report-doublevec.xml: found 1 matching files and directories

WARNING: Failed to load system CertPool: crypto/x509: system root pool is not available on Windows
Uploading artifacts as "junit" to coordinator... ok
id=109792 responseStatus=201 Created token=DySepPEa
ERROR: Job failed: exit status 1
failed
build-VS2015-x64-shared-TRUE-no-apps Build
OS/Arch:      windows/amd64
Uploading artifacts...
Runtime platform
arch=amd64 os=windows pid=916 revision=efa30e33 version=13.2.1
build-release/unittests/report.xml: found 1 matching files and directories

build-release/unittests/report-customvec.xml: found 1 matching files and directories

build-release/unittests/report-doublevec.xml: found 1 matching files and directories

WARNING: Failed to load system CertPool: crypto/x509: system root pool is not available on Windows
Uploading artifacts as "junit" to coordinator... ok
id=109793 responseStatus=201 Created token=u3WJFTtN
ERROR: Job failed: exit status 1
failed
test-debug-clang-cpp14 Test

2 FAILED TESTS
Uploading artifacts for failed job
Uploading artifacts...
build-clang-cpp14-debug-Vector-Checks/Unittests/report.xml: found 1 matching files and directories

build-clang-cpp14-debug-Vector-Checks/Unittests/report-customvec.xml: found 1 matching files and directories

build-clang-cpp14-debug-Vector-Checks/Unittests/report-doublevec.xml: found 1 matching files and directories

Uploading artifacts as "junit" to coordinator... ok
id=109802 responseStatus=201 Created token=UuM5As2S
ERROR: Job failed: exit code 1
failed
test-debug-gcc-cpp14 Test

2 FAILED TESTS
Uploading artifacts for failed job
Uploading artifacts...
build-gcc-cpp14-debug-Vector-Checks/Unittests/report.xml: found 1 matching files and directories

build-gcc-cpp14-debug-Vector-Checks/Unittests/report-customvec.xml: found 1 matching files and directories

build-gcc-cpp14-debug-Vector-Checks/Unittests/report-doublevec.xml: found 1 matching files and directories

Uploading artifacts as "junit" to coordinator... ok
id=109800 responseStatus=201 Created token=zpk7n8ty
ERROR: Job failed: exit code 1
failed
test-debug-clang-cpp11 Test

2 FAILED TESTS
Uploading artifacts for failed job
Uploading artifacts...
build-clang-cpp11-debug-Vector-Checks/Unittests/report.xml: found 1 matching files and directories

build-clang-cpp11-debug-Vector-Checks/Unittests/report-customvec.xml: found 1 matching files and directories

build-clang-cpp11-debug-Vector-Checks/Unittests/report-doublevec.xml: found 1 matching files and directories

Uploading artifacts as "junit" to coordinator... ok
id=109798 responseStatus=201 Created token=LUGby-XS
ERROR: Job failed: exit code 1
failed
test-release-gcc-cpp14 Test

2 FAILED TESTS
Uploading artifacts for failed job
Uploading artifacts...
build-gcc-cpp14-release-Vector-Checks/Unittests/report.xml: found 1 matching files and directories

build-gcc-cpp14-release-Vector-Checks/Unittests/report-customvec.xml: found 1 matching files and directories

build-gcc-cpp14-release-Vector-Checks/Unittests/report-doublevec.xml: found 1 matching files and directories

Uploading artifacts as "junit" to coordinator... ok
id=109801 responseStatus=201 Created token=bRRofTQv
ERROR: Job failed: exit code 1
failed
macos-cpp14-release Build
[  PASSED  ] 273 tests.
[ FAILED ] 2 tests, listed below:
[ FAILED ] OpenMeshReadWritePLY.LoadSimplePLYWithFaceColors
[ FAILED ] OpenMeshReadWritePLY.WriteAndReadPLYWithFaceColors

2 FAILED TESTS
Running after_script
Uploading artifacts for failed job
ERROR: Job failed: exit status 1
failed
test-release-clang-cpp11 Test

2 FAILED TESTS
Uploading artifacts for failed job
Uploading artifacts...
build-clang-cpp11-release-Vector-Checks/Unittests/report.xml: found 1 matching files and directories

build-clang-cpp11-release-Vector-Checks/Unittests/report-customvec.xml: found 1 matching files and directories

build-clang-cpp11-release-Vector-Checks/Unittests/report-doublevec.xml: found 1 matching files and directories

Uploading artifacts as "junit" to coordinator... ok
id=109799 responseStatus=201 Created token=kcs2mgLR
ERROR: Job failed: exit code 1
failed
test-release-gcc-cpp11 Test

2 FAILED TESTS
Uploading artifacts for failed job
Uploading artifacts...
build-gcc-cpp11-release-Vector-Checks/Unittests/report.xml: found 1 matching files and directories

build-gcc-cpp11-release-Vector-Checks/Unittests/report-customvec.xml: found 1 matching files and directories

build-gcc-cpp11-release-Vector-Checks/Unittests/report-doublevec.xml: found 1 matching files and directories

Uploading artifacts as "junit" to coordinator... ok
id=109797 responseStatus=201 Created token=1yy5-zNr
ERROR: Job failed: exit code 1
failed
test-debug-gcc-cpp11 Test

2 FAILED TESTS
Uploading artifacts for failed job
Uploading artifacts...
build-gcc-cpp11-debug-Vector-Checks/Unittests/report.xml: found 1 matching files and directories

build-gcc-cpp11-debug-Vector-Checks/Unittests/report-customvec.xml: found 1 matching files and directories

build-gcc-cpp11-debug-Vector-Checks/Unittests/report-doublevec.xml: found 1 matching files and directories

Uploading artifacts as "junit" to coordinator... ok
id=109796 responseStatus=201 Created token=bA7kcWqi
ERROR: Job failed: exit code 1
failed
build-VS2017-x64-shared-FALSE-apps Build
OS/Arch:      windows/amd64
Uploading artifacts...
Runtime platform
arch=amd64 os=windows pid=4120 revision=efa30e33 version=13.2.1
build-release/unittests/report.xml: found 1 matching files and directories

build-release/unittests/report-customvec.xml: found 1 matching files and directories

build-release/unittests/report-doublevec.xml: found 1 matching files and directories

WARNING: Failed to load system CertPool: crypto/x509: system root pool is not available on Windows
Uploading artifacts as "junit" to coordinator... ok
id=109790 responseStatus=201 Created token=MYAQyg_3
ERROR: Job failed: exit status 1
failed
macos-cpp14-debug Build
[  PASSED  ] 273 tests.
[ FAILED ] 2 tests, listed below:
[ FAILED ] OpenMeshReadWritePLY.LoadSimplePLYWithFaceColors
[ FAILED ] OpenMeshReadWritePLY.WriteAndReadPLYWithFaceColors

2 FAILED TESTS
Running after_script
Uploading artifacts for failed job
ERROR: Job failed: exit status 1
failed
build-VS2017-x64-shared-FALSE-no-apps Build
OS/Arch:      windows/amd64
Uploading artifacts...
Runtime platform
arch=amd64 os=windows pid=12492 revision=efa30e33 version=13.2.1
build-release/unittests/report.xml: found 1 matching files and directories

build-release/unittests/report-customvec.xml: found 1 matching files and directories

build-release/unittests/report-doublevec.xml: found 1 matching files and directories

WARNING: Failed to load system CertPool: crypto/x509: system root pool is not available on Windows
Uploading artifacts as "junit" to coordinator... ok
id=109791 responseStatus=201 Created token=yUqC3kXz
ERROR: Job failed: exit status 1
failed
build-VS2017-x64-shared-TRUE-no-apps Build
OS/Arch:      windows/amd64
Uploading artifacts...
Runtime platform
arch=amd64 os=windows pid=26892 revision=efa30e33 version=13.2.1
build-release/unittests/report.xml: found 1 matching files and directories

build-release/unittests/report-customvec.xml: found 1 matching files and directories

build-release/unittests/report-doublevec.xml: found 1 matching files and directories

WARNING: Failed to load system CertPool: crypto/x509: system root pool is not available on Windows
Uploading artifacts as "junit" to coordinator... ok
id=109789 responseStatus=201 Created token=4SkbcY_N
ERROR: Job failed: exit status 1
failed
build-VS2017-x64-shared-TRUE-apps Build
OS/Arch:      windows/amd64
Uploading artifacts...
Runtime platform
arch=amd64 os=windows pid=14952 revision=efa30e33 version=13.2.1
build-release/unittests/report.xml: found 1 matching files and directories

build-release/unittests/report-customvec.xml: found 1 matching files and directories

build-release/unittests/report-doublevec.xml: found 1 matching files and directories

WARNING: Failed to load system CertPool: crypto/x509: system root pool is not available on Windows
Uploading artifacts as "junit" to coordinator... ok
id=109788 responseStatus=201 Created token=-Vgx3Gdb
ERROR: Job failed: exit status 1
failed
macos-cpp11-debug Build
[  PASSED  ] 273 tests.
[ FAILED ] 2 tests, listed below:
[ FAILED ] OpenMeshReadWritePLY.LoadSimplePLYWithFaceColors
[ FAILED ] OpenMeshReadWritePLY.WriteAndReadPLYWithFaceColors

2 FAILED TESTS
Running after_script
Uploading artifacts for failed job
ERROR: Job failed: exit status 1
failed
macos-cpp11-release Build
[  PASSED  ] 273 tests.
[ FAILED ] 2 tests, listed below:
[ FAILED ] OpenMeshReadWritePLY.LoadSimplePLYWithFaceColors
[ FAILED ] OpenMeshReadWritePLY.WriteAndReadPLYWithFaceColors

2 FAILED TESTS
Running after_script
Uploading artifacts for failed job
ERROR: Job failed: exit status 1