Added addresses to scene graph.

9 jobs for fixes_#1 in 70 minutes and 28 seconds
Status Job ID Name Coverage
  Test
failed #7001
MultiThreads Linux
clang-c++11-Qt4

00:00:00

passed #7005
MultiThreads Linux
clang-c++11-Qt5

00:09:33

failed #7003
MultiThreads Linux
clang-c++98-Qt4

00:04:07

failed #7007
MultiThreads Linux
clang-c++98-Qt5

00:04:46

passed #7008
MultiThreads Linux
cppcheck

00:39:06

passed #7000
Linux
gcc-c++11-Qt4

00:04:22

passed #7004
Linux
gcc-c++11-Qt5

00:04:07

failed #7002
Linux
gcc-c++98-Qt4

00:02:48

failed #7006
Linux
gcc-c++98-Qt5

00:01:35

 
Name Stage Failure
failed
clang-c++98-Qt5 Test There is an unknown failure, please try again
[ 75%] Building CXX object libs_required/OpenMesh/src/Unittests/CMakeFiles/unittests.dir/unittests_trimesh_circulator_current_halfedge_handle_replacement.cc.o
[ 75%] Building CXX object libs_required/OpenMesh/src/Unittests/CMakeFiles/unittests.dir/unittests_property.cc.o
[ 75%] Built target openmesh
[ 76%] Linking CXX executable ../../../../Unittests/unittests
[ 76%] Built target unittests
Makefile:149: recipe for target 'all' failed
make: *** [all] Error 2

ERROR: Build failed: exit status 1
failed
gcc-c++98-Qt5 Test There is an unknown failure, please try again
[ 56%] Built target Plugin-VSI
[ 56%] Linking CXX shared module ../Build/lib/plugins/libPlugin-Decimater.so
[ 56%] Built target Plugin-Decimater
[ 56%] Linking CXX shared module ../Build/lib/plugins/libPlugin-PropertyVis.so
[ 56%] Built target Plugin-PropertyVis
Makefile:149: recipe for target 'all' failed
make: *** [all] Error 2

ERROR: Build failed: exit status 1
failed
clang-c++98-Qt4 Test There is an unknown failure, please try again
1 warning generated.
[ 75%] Linking CXX shared library ../../../../Build/python/openmesh.so
[ 75%] Built target openmesh
[ 76%] Linking CXX executable ../../../../Unittests/unittests
[ 76%] Built target unittests
Makefile:149: recipe for target 'all' failed
make: *** [all] Error 2

ERROR: Build failed: exit status 1
failed
gcc-c++98-Qt4 Test There is an unknown failure, please try again
[ 75%] Building CXX object libs_required/OpenMesh/src/Unittests/CMakeFiles/unittests.dir/unittests_property.cc.o
[ 76%] Linking CXX executable ../../../../Unittests/unittests
[ 76%] Built target unittests
[ 76%] Linking CXX shared library ../../../../Build/python/openmesh.so
[ 76%] Built target openmesh
Makefile:149: recipe for target 'all' failed
make: *** [all] Error 2

ERROR: Build failed: exit status 1
failed
clang-c++11-Qt4 Test There is an unknown failure, please try again
gitlab-ci-multi-runner 1.3.2 (0323456)
Using Shell executor...
Running on herzog...
error: could not lock config file /home/gitlab-runner/.gitconfig: File exists

ERROR: Build failed: exit status 1