propvis

21 jobs for dev_mh in 14 minutes and 23 seconds (queued for 2 seconds)
latest
Status Job ID Name Coverage
  Build
passed #67692
qt5113 Apple
Mac-Cpp11

00:12:12

passed #67690
Qt5101 VS2015
VS2015-Qt-5.10.1-x64

00:13:48

passed #67691
Qt5101 VS2017
VS2017-Qt-5.10.1

00:13:35

failed #67686
MultiThreads stretch Linux
clang-c++11-Qt5.11.2

00:11:40

failed #67687
MultiThreads stretch Linux
clang-c++11-Qt5.9.0

00:11:05

failed #67689
MultiThreads stretch Linux
cppcheck

00:01:35

failed #67688
MultiThreads stretch Linux
debug-clang-c++11-Qt5.9.0

00:09:42

passed #67685
stretch Linux
debug-gcc-c++11-Qt5.11.2

00:08:59

passed #67684
stretch Linux
debug-gcc-c++11-Qt5.9.0

00:08:34

passed #67682
stretch Linux
gcc-c++11-Qt5.11.2

00:05:26

passed #67683
stretch Linux
gcc-c++11-Qt5.9.0

00:04:39

 
  Test
skipped #67702
qt5113 Apple
Test:Mac-Cpp11
skipped #67700
Qt5101 VS2015
Test:VS2015-Qt-5.10.1-x64
skipped #67701
Qt5101 VS2017
Test:VS2017-Qt-5.10.1
skipped #67699
MultiThreads stretch Linux
debug-test-clang-c++11-Qt5.9.0
skipped #67696
stretch Linux
debug-test-gcc-c++11-Qt5.11.2
skipped #67695
stretch Linux
debug-test-gcc-c++11-Qt5.9.0
skipped #67697
MultiThreads stretch Linux
test-clang-c++11-Qt5.11.2
skipped #67698
MultiThreads stretch Linux
test-clang-c++11-Qt5.9.0
skipped #67693
stretch Linux
test-gcc-c++11-Qt5.11.2
skipped #67694
stretch Linux
test-gcc-c++11-Qt5.9.0
 
Name Stage Failure
failed
debug-clang-c++11-Qt5.9.0 Build
                return NULL;
~~~~~~ ^~~~
false
1 warning generated.
[ 87%] Linking CXX executable ../../Build/bin/OpenFlipper
[ 87%] Built target OpenFlipper
Makefile:151: recipe for target 'all' failed
make: *** [all] Error 2
ERROR: Job failed: exit status 1
failed
clang-c++11-Qt5.11.2 Build
1 warning and 1 error generated.
Plugin-PropertyVis/CMakeFiles/Plugin-PropertyVis.dir/build.make:348: recipe for target 'Plugin-PropertyVis/CMakeFiles/Plugin-PropertyVis.dir/Models/PropertyNameListModel.cc.o' failed
make[2]: *** [Plugin-PropertyVis/CMakeFiles/Plugin-PropertyVis.dir/Models/PropertyNameListModel.cc.o] Error 1
make[2]: *** Waiting for unfinished jobs....
CMakeFiles/Makefile2:9030: recipe for target 'Plugin-PropertyVis/CMakeFiles/Plugin-PropertyVis.dir/all' failed
make[1]: *** [Plugin-PropertyVis/CMakeFiles/Plugin-PropertyVis.dir/all] Error 2
Makefile:151: recipe for target 'all' failed
make: *** [all] Error 2
ERROR: Job failed: exit status 1
failed
clang-c++11-Qt5.9.0 Build
[100%] Linking CXX shared module ../../Build/lib/plugins/libPlugin-FileBVH.so
[100%] Built target Plugin-FileBVH
[100%] Linking CXX shared module ../../Build/lib/plugins/libPlugin-FileBundle.so
[100%] Built target Plugin-FileBundle
CMakeFiles/Makefile2:9030: recipe for target 'Plugin-PropertyVis/CMakeFiles/Plugin-PropertyVis.dir/all' failed
make[1]: *** [Plugin-PropertyVis/CMakeFiles/Plugin-PropertyVis.dir/all] Error 2
Makefile:151: recipe for target 'all' failed
make: *** [all] Error 2
ERROR: Job failed: exit status 1
failed
cppcheck Build

==============================================================================
CPPCHECK Summary
==============================================================================


Total CPPCHECK error Count is 89, which is too High (Max is 80)! CPPCHECK Run failed

ERROR: Job failed: exit status 1