Switched to google test 1.10.0

31 jobs for Test_VSI_Python in 8 minutes and 55 seconds (queued for 3 seconds)
latest
Status Job ID Name Coverage
  Build
canceled #128067
qt5113 Apple
Mac-Cpp11

00:08:53

canceled #128065
Python39 Qt5141 VS2017
VS2017-Qt5.14.2-x64

00:08:55

canceled #128066
Qt5141 VS2017
VS2017-Qt5.14.2-x64-NOPYTHON

00:08:55

canceled #128063
Python39 Qt5150 VS2019
VS2019-Qt5.15.0-x64

00:08:55

canceled #128064
Qt5150 VS2019
VS2019-Qt5.15.0-x64-NOPYTHON

canceled #128057
stretch Linux
build-debug-clang-cpp11-qt5.15.1

00:00:34

canceled #128058
stretch Linux
build-debug-clang-cpp11-qt5.15.1-nopython

00:00:09

failed #128053
stretch Linux
build-debug-gcc-cpp11-qt5.15.1

00:02:45

failed #128054
stretch Linux
build-debug-gcc-cpp11-qt5.15.1-nopython

00:02:50

canceled #128059
stretch Linux
build-release-clang-cpp11-qt5.15.1

canceled #128060
stretch Linux
build-release-clang-cpp11-qt5.15.1-nopython

failed #128047
stretch Linux
build-release-gcc-cpp11-qt5.11.2

00:07:25

failed #128048
stretch Linux
build-release-gcc-cpp11-qt5.11.2-nopython

00:05:52

failed #128049
stretch Linux
build-release-gcc-cpp11-qt5.12.2

00:06:10

failed #128050
stretch Linux
build-release-gcc-cpp11-qt5.12.2-nopython

00:05:34

failed #128051
stretch Linux
build-release-gcc-cpp11-qt5.13.0

00:05:30

canceled #128052
stretch Linux
build-release-gcc-cpp11-qt5.13.0-nopython

00:03:22

canceled #128055
stretch Linux
build-release-gcc-cpp11-qt5.15.1

00:02:42

canceled #128056
stretch Linux
build-release-gcc-cpp11-qt5.15.1-nopython

00:01:29

canceled #128062
MultiThreads stretch Linux
cppcheck

canceled #128061
stretch Linux
iwyu-release-clang-cpp11-qt5.13.0

 
  Test
canceled #128077
qt5113 Apple
Test:Mac-Cpp11

canceled #128076
Python39 Qt5141 VS2017
Test:VS2017-Qt5.14.2-x64

canceled #128075
Python39 Qt5150 VS2019
Test:VS2019-Qt5.15.0-x64

canceled #128073
MultiThreads stretch Linux
test-debug-clang-cpp11-qt5.15.1

skipped #128071
MultiThreads stretch Linux
test-debug-gcc-cpp11-qt5.15.1
canceled #128074
MultiThreads stretch Linux
test-release-clang-cpp11-qt5.15.1

skipped #128068
MultiThreads stretch Linux
test-release-gcc-cpp11-qt5.11.2
skipped #128069
MultiThreads stretch Linux
test-release-gcc-cpp11-qt5.12.2
skipped #128070
MultiThreads stretch Linux
test-release-gcc-cpp11-qt5.13.0
canceled #128072
MultiThreads stretch Linux
test-release-gcc-cpp11-qt5.15.1

 
Name Stage Failure
failed
build-debug-gcc-cpp11-qt5.15.1-nopython Build
/usr/include/gtest/gtest-printers.h:271: undefined reference to `testing::internal::PrintBytesInObjectTo(unsigned char const*, unsigned long, std::ostream*)'
/usr/bin/ld: CMakeFiles/unittests_doublevec.dir/unittests_read_write_OM.cc.o: in function `void testing::internal::FallbackPrinter::PrintValue<RegisteredDataType>(RegisteredDataType const&, std::ostream*)':
/usr/include/gtest/gtest-printers.h:271: undefined reference to `testing::internal::PrintBytesInObjectTo(unsigned char const*, unsigned long, std::ostream*)'
collect2: error: ld returned 1 exit status
make[2]: *** [OpenFlipper/libs_required/OpenMesh/src/Unittests/CMakeFiles/unittests_doublevec.dir/build.make:977: Unittests/unittests_doublevec] Error 1
make[1]: *** [CMakeFiles/Makefile2:7729: OpenFlipper/libs_required/OpenMesh/src/Unittests/CMakeFiles/unittests_doublevec.dir/all] Error 2
make: *** [Makefile:171: all] Error 2
Cleaning up file based variables
ERROR: Job failed: exit status 1
failed
build-debug-gcc-cpp11-qt5.15.1 Build
/usr/include/gtest/gtest-printers.h:271: undefined reference to `testing::internal::PrintBytesInObjectTo(unsigned char const*, unsigned long, std::ostream*)'
/usr/bin/ld: CMakeFiles/unittests_doublevec.dir/unittests_read_write_OM.cc.o: in function `void testing::internal::FallbackPrinter::PrintValue<RegisteredDataType>(RegisteredDataType const&, std::ostream*)':
/usr/include/gtest/gtest-printers.h:271: undefined reference to `testing::internal::PrintBytesInObjectTo(unsigned char const*, unsigned long, std::ostream*)'
collect2: error: ld returned 1 exit status
make[2]: *** [OpenFlipper/libs_required/OpenMesh/src/Unittests/CMakeFiles/unittests_doublevec.dir/build.make:977: Unittests/unittests_doublevec] Error 1
make[1]: *** [CMakeFiles/Makefile2:7750: OpenFlipper/libs_required/OpenMesh/src/Unittests/CMakeFiles/unittests_doublevec.dir/all] Error 2
make: *** [Makefile:171: all] Error 2
Cleaning up file based variables
ERROR: Job failed: exit status 1
failed
build-release-gcc-cpp11-qt5.13.0 Build
      |                                     ^~~~~~~~~~~~~~~~~~
collect2: error: ld returned 1 exit status
make[2]: *** [OpenFlipper/libs_required/OpenMesh/src/Unittests/CMakeFiles/unittests_doublevec.dir/build.make:977: Unittests/unittests_doublevec] Error 1
make[1]: *** [CMakeFiles/Makefile2:7750: OpenFlipper/libs_required/OpenMesh/src/Unittests/CMakeFiles/unittests_doublevec.dir/all] Error 2
[ 76%] Linking CXX executable ../../Build/bin/OpenFlipper
[ 76%] Built target OpenFlipper
make: *** [Makefile:171: all] Error 2
Cleaning up file based variables
ERROR: Job failed: exit status 1
failed
build-release-gcc-cpp11-qt5.12.2-nopython Build
[ 81%] Linking CXX executable ../../Build/bin/OpenFlipper
/usr/bin/ld: CMakeFiles/OpenFlipper.dir/OpenFlipper_autogen/mocs_compilation.cpp.o:(.data.rel.ro._ZTV17PythonInterpreter[_ZTV17PythonInterpreter]+0x28): undefined reference to `PythonInterpreter::~PythonInterpreter()'
/usr/bin/ld: CMakeFiles/OpenFlipper.dir/OpenFlipper_autogen/mocs_compilation.cpp.o:(.data.rel.ro._ZTV17PythonInterpreter[_ZTV17PythonInterpreter]+0x30): undefined reference to `PythonInterpreter::~PythonInterpreter()'
collect2: error: ld returned 1 exit status
make[2]: *** [OpenFlipper/CoreApp/CMakeFiles/OpenFlipper.dir/build.make:1349: Build/bin/OpenFlipper] Error 1
make[1]: *** [CMakeFiles/Makefile2:14875: OpenFlipper/CoreApp/CMakeFiles/OpenFlipper.dir/all] Error 2
make: *** [Makefile:171: all] Error 2
Cleaning up file based variables
ERROR: Job failed: exit status 1
failed
build-release-gcc-cpp11-qt5.11.2-nopython Build
/usr/bin/ld: CMakeFiles/unittests_customvec.dir/unittests_propertymanager.cc.o: in function `void testing::internal::FallbackPrinter::PrintValue<Custom::Vec<3> >(Custom::Vec<3> const&, std::ostream*)':
/usr/include/gtest/gtest-printers.h:271: undefined reference to `testing::internal::PrintBytesInObjectTo(unsigned char const*, unsigned long, std::ostream*)'
/usr/bin/ld: CMakeFiles/unittests_customvec.dir/unittests_propertymanager.cc.o:/usr/include/gtest/gtest-printers.h:271: more undefined references to `testing::internal::PrintBytesInObjectTo(unsigned char const*, unsigned long, std::ostream*)' follow
collect2: error: ld returned 1 exit status
make[2]: *** [OpenFlipper/libs_required/OpenMesh/src/Unittests/CMakeFiles/unittests_customvec.dir/build.make:977: Unittests/unittests_customvec] Error 1
make[1]: *** [CMakeFiles/Makefile2:7758: OpenFlipper/libs_required/OpenMesh/src/Unittests/CMakeFiles/unittests_customvec.dir/all] Error 2
make: *** [Makefile:171: all] Error 2
Cleaning up file based variables
ERROR: Job failed: exit status 1
failed
build-release-gcc-cpp11-qt5.11.2 Build
/usr/bin/ld: CMakeFiles/unittests.dir/unittests_read_write_OM.cc.o: in function `void testing::internal::FallbackPrinter::PrintValue<RegisteredDataType>(RegisteredDataType const&, std::ostream*)':
/usr/include/gtest/gtest-printers.h:271: undefined reference to `testing::internal::PrintBytesInObjectTo(unsigned char const*, unsigned long, std::ostream*)'
/usr/bin/ld: CMakeFiles/unittests.dir/unittests_read_write_OM.cc.o:/usr/include/gtest/gtest-printers.h:271: more undefined references to `testing::internal::PrintBytesInObjectTo(unsigned char const*, unsigned long, std::ostream*)' follow
collect2: error: ld returned 1 exit status
make[2]: *** [OpenFlipper/libs_required/OpenMesh/src/Unittests/CMakeFiles/unittests.dir/build.make:977: Unittests/unittests] Error 1
make[1]: *** [CMakeFiles/Makefile2:7808: OpenFlipper/libs_required/OpenMesh/src/Unittests/CMakeFiles/unittests.dir/all] Error 2
make: *** [Makefile:171: all] Error 2
Cleaning up file based variables
ERROR: Job failed: exit status 1
failed
build-release-gcc-cpp11-qt5.12.2 Build
                 from /local/gitlab-runner/builds/LXd-zr_A/0/OpenFlipper-Free/OpenFlipper-Free/OpenFlipper/PythonInterpreter/PythonInterpreter.cc:44:
/usr/include/python3.9/ceval.h:130:37: note: declared here
130 | Py_DEPRECATED(3.9) PyAPI_FUNC(void) PyEval_InitThreads(void);
| ^~~~~~~~~~~~~~~~~~
[ 77%] Linking CXX executable ../../Build/bin/OpenFlipper
[ 77%] Built target OpenFlipper
make: *** [Makefile:171: all] Error 2
Cleaning up file based variables
ERROR: Job failed: exit status 1