updates file plugin collection to latest commit for ci

67 jobs for fix/use_default_segfaults_on_correct_defaults_ci in 52 minutes and 33 seconds (queued for 3 seconds)
latest
Status Job ID Name Coverage
  Build
passed #127763
Apple qt5113
Mac-Cpp11

00:28:40

passed #127761
VS2017 Qt5141 Python39
VS2017-Qt5.14.2-x64

00:18:04

passed #127762
VS2017 Qt5141
VS2017-Qt5.14.2-x64-NOPYTHON

00:15:03

passed #127759
VS2019 Qt5150 Python39
VS2019-Qt5.15.0-x64

00:12:40

passed #127760
VS2019 Qt5150
VS2019-Qt5.15.0-x64-NOPYTHON

00:12:08

failed #127780
stretch Linux
build-debug-clang-cpp11-qt5.15.1

00:04:52

failed #127781
stretch Linux
build-debug-clang-cpp11-qt5.15.1-nopython

00:05:46

failed #127776
stretch Linux
build-debug-gcc-cpp11-qt5.15.1

00:02:52

failed #127777
stretch Linux
build-debug-gcc-cpp11-qt5.15.1-nopython

00:02:29

failed #127782
stretch Linux
build-release-clang-cpp11-qt5.15.1

00:08:53

failed #127783
stretch Linux
build-release-clang-cpp11-qt5.15.1-nopython

00:10:01

failed #127770
stretch Linux
build-release-gcc-cpp11-qt5.11.2

00:05:40

failed #127771
stretch Linux
build-release-gcc-cpp11-qt5.11.2-nopython

00:04:52

failed #127772
stretch Linux
build-release-gcc-cpp11-qt5.12.2

00:06:20

failed #127773
stretch Linux
build-release-gcc-cpp11-qt5.12.2-nopython

00:04:57

failed #127774
stretch Linux
build-release-gcc-cpp11-qt5.13.0

00:05:36

failed #127775
stretch Linux
build-release-gcc-cpp11-qt5.13.0-nopython

00:04:14

failed #127778
stretch Linux
build-release-gcc-cpp11-qt5.15.1

00:04:31

failed #127779
stretch Linux
build-release-gcc-cpp11-qt5.15.1-nopython

00:04:48

failed #127784
MultiThreads stretch Linux
cppcheck

00:01:53

passed #127757
Linux stretch
iwyu-release-clang-cpp11-qt5.13.0

00:18:22

failed #127729
qt5113 Apple
Mac-Cpp11

00:01:54

failed #127727
Python39 Qt5141 VS2017
VS2017-Qt5.14.2-x64

00:08:01

failed #127728
Qt5141 VS2017
VS2017-Qt5.14.2-x64-NOPYTHON

00:07:04

failed #127725
Python39 Qt5150 VS2019
VS2019-Qt5.15.0-x64

00:07:12

failed #127726
Qt5150 VS2019
VS2019-Qt5.15.0-x64-NOPYTHON

00:06:42

failed #127719
stretch Linux
build-debug-clang-cpp11-qt5.15.1

00:01:38

failed #127753
Linux stretch
build-debug-clang-cpp11-qt5.15.1

00:05:57

failed #127754
Linux stretch
build-debug-clang-cpp11-qt5.15.1-nopython

00:08:31

failed #127720
stretch Linux
build-debug-clang-cpp11-qt5.15.1-nopython

00:02:00

failed #127715
stretch Linux
build-debug-gcc-cpp11-qt5.15.1

00:02:23

failed #127749
Linux stretch
build-debug-gcc-cpp11-qt5.15.1

00:03:38

failed #127716
stretch Linux
build-debug-gcc-cpp11-qt5.15.1-nopython

00:01:45

failed #127750
Linux stretch
build-debug-gcc-cpp11-qt5.15.1-nopython

00:03:07

failed #127721
stretch Linux
build-release-clang-cpp11-qt5.15.1

00:02:05

failed #127755
Linux stretch
build-release-clang-cpp11-qt5.15.1

00:10:47

failed #127756
Linux stretch
build-release-clang-cpp11-qt5.15.1-nopython

00:08:26

failed #127722
stretch Linux
build-release-clang-cpp11-qt5.15.1-nopython

00:01:58

failed #127709
stretch Linux
build-release-gcc-cpp11-qt5.11.2

00:01:51

failed #127743
Linux stretch
build-release-gcc-cpp11-qt5.11.2

00:06:04

failed #127710
stretch Linux
build-release-gcc-cpp11-qt5.11.2-nopython

00:02:22

failed #127744
Linux stretch
build-release-gcc-cpp11-qt5.11.2-nopython

00:06:15

failed #127711
stretch Linux
build-release-gcc-cpp11-qt5.12.2

00:01:26

failed #127745
Linux stretch
build-release-gcc-cpp11-qt5.12.2

00:06:13

failed #127712
stretch Linux
build-release-gcc-cpp11-qt5.12.2-nopython

00:01:47

failed #127746
Linux stretch
build-release-gcc-cpp11-qt5.12.2-nopython

00:05:44

failed #127747
Linux stretch
build-release-gcc-cpp11-qt5.13.0

00:05:39

failed #127713
stretch Linux
build-release-gcc-cpp11-qt5.13.0

00:01:19

failed #127714
stretch Linux
build-release-gcc-cpp11-qt5.13.0-nopython

00:01:41

failed #127748
stretch Linux
build-release-gcc-cpp11-qt5.13.0-nopython

00:05:52

failed #127751
Linux stretch
build-release-gcc-cpp11-qt5.15.1

00:05:33

failed #127717
stretch Linux
build-release-gcc-cpp11-qt5.15.1

00:02:46

failed #127718
stretch Linux
build-release-gcc-cpp11-qt5.15.1-nopython

00:02:43

failed #127752
Linux stretch
build-release-gcc-cpp11-qt5.15.1-nopython

00:05:42

failed #127758
Linux stretch MultiThreads
cppcheck

00:01:42

failed #127724
MultiThreads stretch Linux
cppcheck

00:02:08

failed #127723
stretch Linux
iwyu-release-clang-cpp11-qt5.13.0

00:02:09

 
  Test
passed #127739
qt5113 Apple
Test:Mac-Cpp11

00:00:47

passed #127738
Python39 Qt5141 VS2017
Test:VS2017-Qt5.14.2-x64

00:01:45

passed #127737
Python39 Qt5150 VS2019
Test:VS2019-Qt5.15.0-x64

00:02:02

skipped #127735
MultiThreads stretch Linux
test-debug-clang-cpp11-qt5.15.1
skipped #127733
MultiThreads stretch Linux
test-debug-gcc-cpp11-qt5.15.1
skipped #127736
MultiThreads stretch Linux
test-release-clang-cpp11-qt5.15.1
skipped #127730
MultiThreads stretch Linux
test-release-gcc-cpp11-qt5.11.2
skipped #127731
MultiThreads stretch Linux
test-release-gcc-cpp11-qt5.12.2
skipped #127732
MultiThreads stretch Linux
test-release-gcc-cpp11-qt5.13.0
skipped #127734
MultiThreads stretch Linux
test-release-gcc-cpp11-qt5.15.1
 
Name Stage Failure
failed
cppcheck Build
==============================================================================
CPPCHECK Summary
==============================================================================


Total CPPCHECK error Count is 1994, which is too High (Max is 260)! CPPCHECK Run failed

Cleaning up file based variables
ERROR: Job failed: exit status 1
failed
build-release-clang-cpp11-qt5.15.1-nopython Build
/usr/bin/ld: DWARF error: could not find variable specification at offset 151f
CMakeFiles/unittests_customvec.dir/unittests_propertymanager.cc.o: in function `void testing::internal::FallbackPrinter::PrintValue<Custom::Vec<3> >(Custom::Vec<3> const&, std::ostream*)':
/usr/include/gtest/gtest-printers.h:271: undefined reference to `testing::internal::PrintBytesInObjectTo(unsigned char const*, unsigned long, std::ostream*)'
clang: error: linker command failed with exit code 1 (use -v to see invocation)
make[2]: *** [OpenFlipper/libs_required/OpenMesh/src/Unittests/CMakeFiles/unittests_customvec.dir/build.make:947: Unittests/unittests_customvec] Error 1
make[1]: *** [CMakeFiles/Makefile2:7758: OpenFlipper/libs_required/OpenMesh/src/Unittests/CMakeFiles/unittests_customvec.dir/all] Error 2
make: *** [Makefile:171: all] Error 2
Cleaning up file based variables
ERROR: Job failed: exit status 1
failed
build-release-clang-cpp11-qt5.15.1 Build
/usr/bin/ld: DWARF error: could not find variable specification at offset 151f
CMakeFiles/unittests_customvec.dir/unittests_propertymanager.cc.o: in function `void testing::internal::FallbackPrinter::PrintValue<Custom::Vec<3> >(Custom::Vec<3> const&, std::ostream*)':
/usr/include/gtest/gtest-printers.h:271: undefined reference to `testing::internal::PrintBytesInObjectTo(unsigned char const*, unsigned long, std::ostream*)'
clang: error: linker command failed with exit code 1 (use -v to see invocation)
make[2]: *** [OpenFlipper/libs_required/OpenMesh/src/Unittests/CMakeFiles/unittests_customvec.dir/build.make:947: Unittests/unittests_customvec] Error 1
make[1]: *** [CMakeFiles/Makefile2:7779: OpenFlipper/libs_required/OpenMesh/src/Unittests/CMakeFiles/unittests_customvec.dir/all] Error 2
make: *** [Makefile:171: all] Error 2
Cleaning up file based variables
ERROR: Job failed: exit status 1
failed
build-release-gcc-cpp11-qt5.15.1 Build
                 from /local/gitlab-runner/builds/Xqxo6jru/0/OpenFlipper-Free/OpenFlipper-Free/OpenFlipper/PythonInterpreter/PythonInterpreter.cc:44:
/usr/include/python3.9/ceval.h:130:37: note: declared here
130 | Py_DEPRECATED(3.9) PyAPI_FUNC(void) PyEval_InitThreads(void);
| ^~~~~~~~~~~~~~~~~~
[ 74%] Linking CXX executable ../../Build/bin/OpenFlipper
[ 74%] Built target OpenFlipper
make: *** [Makefile:171: all] Error 2
Cleaning up file based variables
ERROR: Job failed: exit status 1
failed
build-debug-gcc-cpp11-qt5.15.1 Build
/usr/include/gtest/gtest-printers.h:271: undefined reference to `testing::internal::PrintBytesInObjectTo(unsigned char const*, unsigned long, std::ostream*)'
/usr/bin/ld: CMakeFiles/unittests.dir/unittests_property.cc.o: in function `void testing::internal::FallbackPrinter::PrintValue<__gnu_debug::_Safe_iterator<std::__cxx1998::_Bit_iterator, std::__debug::vector<bool, std::allocator<bool> >, std::random_access_iterator_tag> >(__gnu_debug::_Safe_iterator<std::__cxx1998::_Bit_iterator, std::__debug::vector<bool, std::allocator<bool> >, std::random_access_iterator_tag> const&, std::ostream*)':
/usr/include/gtest/gtest-printers.h:271: undefined reference to `testing::internal::PrintBytesInObjectTo(unsigned char const*, unsigned long, std::ostream*)'
collect2: error: ld returned 1 exit status
make[2]: *** [OpenFlipper/libs_required/OpenMesh/src/Unittests/CMakeFiles/unittests.dir/build.make:947: Unittests/unittests] Error 1
make[1]: *** [CMakeFiles/Makefile2:7808: OpenFlipper/libs_required/OpenMesh/src/Unittests/CMakeFiles/unittests.dir/all] Error 2
make: *** [Makefile:171: all] Error 2
Cleaning up file based variables
ERROR: Job failed: exit status 1
failed
build-release-gcc-cpp11-qt5.13.0-nopython Build
[ 76%] Linking CXX executable ../../Build/bin/OpenFlipper
/usr/bin/ld: CMakeFiles/OpenFlipper.dir/OpenFlipper_autogen/mocs_compilation.cpp.o:(.data.rel.ro._ZTV17PythonInterpreter[_ZTV17PythonInterpreter]+0x28): undefined reference to `PythonInterpreter::~PythonInterpreter()'
/usr/bin/ld: CMakeFiles/OpenFlipper.dir/OpenFlipper_autogen/mocs_compilation.cpp.o:(.data.rel.ro._ZTV17PythonInterpreter[_ZTV17PythonInterpreter]+0x30): undefined reference to `PythonInterpreter::~PythonInterpreter()'
collect2: error: ld returned 1 exit status
make[2]: *** [OpenFlipper/CoreApp/CMakeFiles/OpenFlipper.dir/build.make:1356: Build/bin/OpenFlipper] Error 1
make[1]: *** [CMakeFiles/Makefile2:14875: OpenFlipper/CoreApp/CMakeFiles/OpenFlipper.dir/all] Error 2
make: *** [Makefile:171: all] Error 2
Cleaning up file based variables
ERROR: Job failed: exit status 1
failed
build-release-gcc-cpp11-qt5.13.0 Build
                 from /local/gitlab-runner/builds/96c8e8bf/0/OpenFlipper-Free/OpenFlipper-Free/OpenFlipper/PythonInterpreter/PythonInterpreter.cc:44:
/usr/include/python3.9/ceval.h:130:37: note: declared here
130 | Py_DEPRECATED(3.9) PyAPI_FUNC(void) PyEval_InitThreads(void);
| ^~~~~~~~~~~~~~~~~~
[ 75%] Linking CXX executable ../../Build/bin/OpenFlipper
[ 75%] Built target OpenFlipper
make: *** [Makefile:171: all] Error 2
Cleaning up file based variables
ERROR: Job failed: exit status 1
failed
build-release-gcc-cpp11-qt5.12.2-nopython Build
/usr/bin/ld: CMakeFiles/unittests_doublevec.dir/unittests_property.cc.o: in function `void testing::internal::FallbackPrinter::PrintValue<__gnu_debug::_Safe_iterator<std::__cxx1998::_Bit_iterator, std::__debug::vector<bool, std::allocator<bool> >, std::random_access_iterator_tag> >(__gnu_debug::_Safe_iterator<std::__cxx1998::_Bit_iterator, std::__debug::vector<bool, std::allocator<bool> >, std::random_access_iterator_tag> const&, std::ostream*)':
/usr/include/gtest/gtest-printers.h:271: undefined reference to `testing::internal::PrintBytesInObjectTo(unsigned char const*, unsigned long, std::ostream*)'
/usr/bin/ld: /usr/include/gtest/gtest-printers.h:271: undefined reference to `testing::internal::PrintBytesInObjectTo(unsigned char const*, unsigned long, std::ostream*)'
collect2: error: ld returned 1 exit status
make[2]: *** [OpenFlipper/libs_required/OpenMesh/src/Unittests/CMakeFiles/unittests_doublevec.dir/build.make:947: Unittests/unittests_doublevec] Error 1
make[1]: *** [CMakeFiles/Makefile2:7729: OpenFlipper/libs_required/OpenMesh/src/Unittests/CMakeFiles/unittests_doublevec.dir/all] Error 2
make: *** [Makefile:171: all] Error 2
Cleaning up file based variables
ERROR: Job failed: exit status 1
failed
build-release-gcc-cpp11-qt5.12.2 Build
                 from /local/gitlab-runner/builds/LXd-zr_A/0/OpenFlipper-Free/OpenFlipper-Free/OpenFlipper/PythonInterpreter/PythonInterpreter.cc:44:
/usr/include/python3.9/ceval.h:130:37: note: declared here
130 | Py_DEPRECATED(3.9) PyAPI_FUNC(void) PyEval_InitThreads(void);
| ^~~~~~~~~~~~~~~~~~
[ 70%] Linking CXX executable ../../Build/bin/OpenFlipper
[ 70%] Built target OpenFlipper
make: *** [Makefile:171: all] Error 2
Cleaning up file based variables
ERROR: Job failed: exit status 1
failed
build-release-gcc-cpp11-qt5.11.2-nopython Build
[ 76%] Linking CXX executable ../../Build/bin/OpenFlipper
/usr/bin/ld: CMakeFiles/OpenFlipper.dir/OpenFlipper_autogen/mocs_compilation.cpp.o:(.data.rel.ro._ZTV17PythonInterpreter[_ZTV17PythonInterpreter]+0x28): undefined reference to `PythonInterpreter::~PythonInterpreter()'
/usr/bin/ld: CMakeFiles/OpenFlipper.dir/OpenFlipper_autogen/mocs_compilation.cpp.o:(.data.rel.ro._ZTV17PythonInterpreter[_ZTV17PythonInterpreter]+0x30): undefined reference to `PythonInterpreter::~PythonInterpreter()'
collect2: error: ld returned 1 exit status
make[2]: *** [OpenFlipper/CoreApp/CMakeFiles/OpenFlipper.dir/build.make:1349: Build/bin/OpenFlipper] Error 1
make[1]: *** [CMakeFiles/Makefile2:14875: OpenFlipper/CoreApp/CMakeFiles/OpenFlipper.dir/all] Error 2
make: *** [Makefile:171: all] Error 2
Cleaning up file based variables
ERROR: Job failed: exit status 1
failed
build-release-gcc-cpp11-qt5.11.2 Build
                 from /local/gitlab-runner/builds/Xqxo6jru/0/OpenFlipper-Free/OpenFlipper-Free/OpenFlipper/PythonInterpreter/PythonInterpreter.cc:44:
/usr/include/python3.9/ceval.h:130:37: note: declared here
130 | Py_DEPRECATED(3.9) PyAPI_FUNC(void) PyEval_InitThreads(void);
| ^~~~~~~~~~~~~~~~~~
[ 75%] Linking CXX executable ../../Build/bin/OpenFlipper
[ 75%] Built target OpenFlipper
make: *** [Makefile:171: all] Error 2
Cleaning up file based variables
ERROR: Job failed: exit status 1
failed
build-debug-clang-cpp11-qt5.15.1-nopython Build
/usr/include/gtest/gtest-printers.h:271: undefined reference to `testing::internal::PrintBytesInObjectTo(unsigned char const*, unsigned long, std::ostream*)'
/usr/bin/ld: CMakeFiles/unittests.dir/unittests_property.cc.o: in function `void testing::internal::FallbackPrinter::PrintValue<__gnu_debug::_Safe_iterator<std::__cxx1998::_Bit_iterator, std::__debug::vector<bool, std::allocator<bool> >, std::random_access_iterator_tag> >(__gnu_debug::_Safe_iterator<std::__cxx1998::_Bit_iterator, std::__debug::vector<bool, std::allocator<bool> >, std::random_access_iterator_tag> const&, std::ostream*)':
/usr/include/gtest/gtest-printers.h:271: undefined reference to `testing::internal::PrintBytesInObjectTo(unsigned char const*, unsigned long, std::ostream*)'
clang: error: linker command failed with exit code 1 (use -v to see invocation)
make[2]: *** [OpenFlipper/libs_required/OpenMesh/src/Unittests/CMakeFiles/unittests.dir/build.make:947: Unittests/unittests] Error 1
make[1]: *** [CMakeFiles/Makefile2:7787: OpenFlipper/libs_required/OpenMesh/src/Unittests/CMakeFiles/unittests.dir/all] Error 2
make: *** [Makefile:171: all] Error 2
Cleaning up file based variables
ERROR: Job failed: exit status 1
failed
build-debug-clang-cpp11-qt5.15.1 Build
/usr/include/gtest/gtest-printers.h:271: undefined reference to `testing::internal::PrintBytesInObjectTo(unsigned char const*, unsigned long, std::ostream*)'
/usr/bin/ld: CMakeFiles/unittests_doublevec.dir/unittests_property.cc.o: in function `void testing::internal::FallbackPrinter::PrintValue<__gnu_debug::_Safe_iterator<std::__cxx1998::_Bit_iterator, std::__debug::vector<bool, std::allocator<bool> >, std::random_access_iterator_tag> >(__gnu_debug::_Safe_iterator<std::__cxx1998::_Bit_iterator, std::__debug::vector<bool, std::allocator<bool> >, std::random_access_iterator_tag> const&, std::ostream*)':
/usr/include/gtest/gtest-printers.h:271: undefined reference to `testing::internal::PrintBytesInObjectTo(unsigned char const*, unsigned long, std::ostream*)'
clang: error: linker command failed with exit code 1 (use -v to see invocation)
make[2]: *** [OpenFlipper/libs_required/OpenMesh/src/Unittests/CMakeFiles/unittests_doublevec.dir/build.make:947: Unittests/unittests_doublevec] Error 1
make[1]: *** [CMakeFiles/Makefile2:7750: OpenFlipper/libs_required/OpenMesh/src/Unittests/CMakeFiles/unittests_doublevec.dir/all] Error 2
make: *** [Makefile:171: all] Error 2
Cleaning up file based variables
ERROR: Job failed: exit status 1
failed
build-release-gcc-cpp11-qt5.15.1-nopython Build
collect2: error: ld returned 1 exit status
make[2]: *** [OpenFlipper/libs_required/OpenMesh/src/Unittests/CMakeFiles/unittests.dir/build.make:947: Unittests/unittests] Error 1
make[1]: *** [CMakeFiles/Makefile2:7787: OpenFlipper/libs_required/OpenMesh/src/Unittests/CMakeFiles/unittests.dir/all] Error 2
collect2: error: ld returned 1 exit status
make[2]: *** [OpenFlipper/libs_required/OpenMesh/src/Unittests/CMakeFiles/unittests_customvec.dir/build.make:947: Unittests/unittests_customvec] Error 1
make[1]: *** [CMakeFiles/Makefile2:7758: OpenFlipper/libs_required/OpenMesh/src/Unittests/CMakeFiles/unittests_customvec.dir/all] Error 2
make: *** [Makefile:171: all] Error 2
Cleaning up file based variables
ERROR: Job failed: exit status 1
failed
build-debug-gcc-cpp11-qt5.15.1-nopython Build
/usr/include/gtest/gtest-printers.h:271: undefined reference to `testing::internal::PrintBytesInObjectTo(unsigned char const*, unsigned long, std::ostream*)'
/usr/bin/ld: CMakeFiles/unittests_customvec.dir/unittests_propertymanager.cc.o: in function `void testing::internal::FallbackPrinter::PrintValue<Custom::Vec<3> >(Custom::Vec<3> const&, std::ostream*)':
/usr/include/gtest/gtest-printers.h:271: undefined reference to `testing::internal::PrintBytesInObjectTo(unsigned char const*, unsigned long, std::ostream*)'
collect2: error: ld returned 1 exit status
make[2]: *** [OpenFlipper/libs_required/OpenMesh/src/Unittests/CMakeFiles/unittests_customvec.dir/build.make:947: Unittests/unittests_customvec] Error 1
make[1]: *** [CMakeFiles/Makefile2:7758: OpenFlipper/libs_required/OpenMesh/src/Unittests/CMakeFiles/unittests_customvec.dir/all] Error 2
make: *** [Makefile:171: all] Error 2
Cleaning up file based variables
ERROR: Job failed: exit status 1