reduced includes by means of static code analysis

8 jobs for improveReducedIncludes
Status Job ID Name Coverage
  Test
failed #836
Linux
clang-c++11-Qt4

00:21:27

passed #840
Linux
clang-c++11-Qt5

00:46:08

failed #838
Linux
clang-c++98-Qt4

00:13:04

failed #842
Linux
clang-c++98-Qt5

00:10:36

failed #835
Linux
gcc-c++11-Qt4

00:18:42

passed #839
Linux
gcc-c++11-Qt5

00:55:56

failed #837
Linux
gcc-c++98-Qt4

00:20:14

failed #841
Linux
gcc-c++98-Qt5

00:18:39

 
Name Stage Failure
failed
clang-c++98-Qt5 Test There is an unknown failure, please try again
1 error generated.
OpenFlipper/CoreApp/CMakeFiles/OpenFlipper.dir/build.make:391: recipe for target 'OpenFlipper/CoreApp/CMakeFiles/OpenFlipper.dir/__/Core/PluginCommunication.cc.o' failed
make[2]: *** [OpenFlipper/CoreApp/CMakeFiles/OpenFlipper.dir/__/Core/PluginCommunication.cc.o] Error 1
CMakeFiles/Makefile2:9083: recipe for target 'OpenFlipper/CoreApp/CMakeFiles/OpenFlipper.dir/all' failed
make[1]: *** [OpenFlipper/CoreApp/CMakeFiles/OpenFlipper.dir/all] Error 2
Makefile:137: recipe for target 'all' failed
make: *** [all] Error 2

ERROR: Build failed with: exit status 1
failed
gcc-c++98-Qt5 Test There is an unknown failure, please try again
                       ^
OpenFlipper/CoreApp/CMakeFiles/OpenFlipper.dir/build.make:575: recipe for target 'OpenFlipper/CoreApp/CMakeFiles/OpenFlipper.dir/__/Core/PluginCommunication.cc.o' failed
make[2]: *** [OpenFlipper/CoreApp/CMakeFiles/OpenFlipper.dir/__/Core/PluginCommunication.cc.o] Error 1
CMakeFiles/Makefile2:9083: recipe for target 'OpenFlipper/CoreApp/CMakeFiles/OpenFlipper.dir/all' failed
make[1]: *** [OpenFlipper/CoreApp/CMakeFiles/OpenFlipper.dir/all] Error 2
Makefile:137: recipe for target 'all' failed
make: *** [all] Error 2

ERROR: Build failed with: exit status 1
failed
clang-c++98-Qt4 Test There is an unknown failure, please try again
1 error generated.
OpenFlipper/CoreApp/CMakeFiles/OpenFlipper.dir/build.make:575: recipe for target 'OpenFlipper/CoreApp/CMakeFiles/OpenFlipper.dir/__/Core/PluginCommunication.cc.o' failed
make[2]: *** [OpenFlipper/CoreApp/CMakeFiles/OpenFlipper.dir/__/Core/PluginCommunication.cc.o] Error 1
CMakeFiles/Makefile2:9083: recipe for target 'OpenFlipper/CoreApp/CMakeFiles/OpenFlipper.dir/all' failed
make[1]: *** [OpenFlipper/CoreApp/CMakeFiles/OpenFlipper.dir/all] Error 2
Makefile:137: recipe for target 'all' failed
make: *** [all] Error 2

ERROR: Build failed with: exit status 1
failed
gcc-c++98-Qt4 Test There is an unknown failure, please try again
                       ^
OpenFlipper/CoreApp/CMakeFiles/OpenFlipper.dir/build.make:713: recipe for target 'OpenFlipper/CoreApp/CMakeFiles/OpenFlipper.dir/__/Core/PluginCommunication.cc.o' failed
make[2]: *** [OpenFlipper/CoreApp/CMakeFiles/OpenFlipper.dir/__/Core/PluginCommunication.cc.o] Error 1
CMakeFiles/Makefile2:9083: recipe for target 'OpenFlipper/CoreApp/CMakeFiles/OpenFlipper.dir/all' failed
make[1]: *** [OpenFlipper/CoreApp/CMakeFiles/OpenFlipper.dir/all] Error 2
Makefile:137: recipe for target 'all' failed
make: *** [all] Error 2

ERROR: Build failed with: exit status 1
failed
clang-c++11-Qt4 Test There is an unknown failure, please try again
4 errors generated.
OpenFlipper/CoreApp/CMakeFiles/OpenFlipper.dir/build.make:736: recipe for target 'OpenFlipper/CoreApp/CMakeFiles/OpenFlipper.dir/__/Logging/PluginLogging.cc.o' failed
make[2]: *** [OpenFlipper/CoreApp/CMakeFiles/OpenFlipper.dir/__/Logging/PluginLogging.cc.o] Error 1
CMakeFiles/Makefile2:9083: recipe for target 'OpenFlipper/CoreApp/CMakeFiles/OpenFlipper.dir/all' failed
make[1]: *** [OpenFlipper/CoreApp/CMakeFiles/OpenFlipper.dir/all] Error 2
Makefile:137: recipe for target 'all' failed
make: *** [all] Error 2

ERROR: Build failed with: exit status 1
failed
gcc-c++11-Qt4 Test There is an unknown failure, please try again
       ^
OpenFlipper/CoreApp/CMakeFiles/OpenFlipper.dir/build.make:736: recipe for target 'OpenFlipper/CoreApp/CMakeFiles/OpenFlipper.dir/__/Logging/PluginLogging.cc.o' failed
make[2]: *** [OpenFlipper/CoreApp/CMakeFiles/OpenFlipper.dir/__/Logging/PluginLogging.cc.o] Error 1
CMakeFiles/Makefile2:9083: recipe for target 'OpenFlipper/CoreApp/CMakeFiles/OpenFlipper.dir/all' failed
make[1]: *** [OpenFlipper/CoreApp/CMakeFiles/OpenFlipper.dir/all] Error 2
Makefile:137: recipe for target 'all' failed
make: *** [all] Error 2

ERROR: Build failed with: exit status 1