Backward compatible ifdefs for Qt Version

25 jobs for Fix_warnings_Qt in 21 minutes and 41 seconds (queued for 2 seconds)
Status Job ID Name Coverage
  Build
failed #101496
qt5113 Apple
Mac-Cpp11

00:13:45

passed #101494
Qt5141 VS2015
VS2015-Qt-5.14.1-x64

00:15:46

passed #101495
Qt5141 VS2017
VS2017-Qt-5.14.1

00:11:15

failed #101490
MultiThreads stretch Linux
clang-c++11-Qt5.11.2

00:07:53

failed #101491
MultiThreads stretch Linux
clang-c++11-Qt5.13.0

00:08:48

passed #101493
MultiThreads stretch Linux
cppcheck

00:01:26

failed #101492
MultiThreads stretch Linux
debug-clang-c++11-Qt5.13.0

00:06:18

failed #101489
stretch Linux
debug-gcc-c++11-Qt5.11.2

00:02:37

failed #101488
stretch Linux
debug-gcc-c++11-Qt5.13.0

00:03:35

failed #101485
stretch Linux
gcc-c++11-Qt5.11.2

00:03:54

failed #101486
stretch Linux
gcc-c++11-Qt5.11.2-nopython

00:02:57

failed #101483
stretch Linux
gcc-c++11-Qt5.12.2

00:03:21

failed #101484
stretch Linux
gcc-c++11-Qt5.12.2-nopython

00:03:35

failed #101487
stretch Linux
gcc-c++11-Qt5.13.0

00:03:52

 
  Test
skipped #101507
qt5113 Apple
Test:Mac-Cpp11
passed #101505
Qt5141 VS2015
Test:VS2015-Qt-5.14.1-x64

00:02:03

passed #101506
Qt5141 VS2017
Test:VS2017-Qt-5.14.1

00:02:16

skipped #101504
MultiThreads stretch Linux
debug-test-clang-c++11-Qt5.13.0
skipped #101501
stretch Linux
debug-test-gcc-c++11-Qt5.11.2
skipped #101500
stretch Linux
debug-test-gcc-c++11-Qt5.13.0
skipped #101502
MultiThreads stretch Linux
test-clang-c++11-Qt5.11.2
skipped #101503
MultiThreads stretch Linux
test-clang-c++11-Qt5.13.0
skipped #101498
stretch Linux
test-gcc-c++11-Qt5.11.2
skipped #101497
stretch Linux
test-gcc-c++11-Qt5.12.2
skipped #101499
stretch Linux
test-gcc-c++11-Qt5.13.0
 
Name Stage Failure
failed
debug-clang-c++11-Qt5.13.0 Build
[ 82%] Linking CXX shared module ../Build/lib/plugins/libPlugin-PrimitivesGenerator.so
2 warnings generated.
[ 82%] Linking CXX shared module ../Build/lib/plugins/libPlugin-Remesher.so
[ 82%] Built target Plugin-Remesher
[ 82%] Built target Plugin-PrimitivesGenerator
make: *** [Makefile:152: all] Error 2
Running after_script
Uploading artifacts for failed job
ERROR: Job failed: exit status 1
failed
clang-c++11-Qt5.13.0 Build
[ 85%] Built target Plugin-Topology
[ 85%] Linking CXX shared module ../Build/lib/plugins/libPlugin-TextureControl.so
[ 85%] Built target Plugin-TextureControl
[ 85%] Linking CXX shared module ../Build/lib/plugins/libPlugin-ViewControl.so
[ 85%] Built target Plugin-ViewControl
make: *** [Makefile:152: all] Error 2
Running after_script
Uploading artifacts for failed job
ERROR: Job failed: exit status 1
failed
clang-c++11-Qt5.11.2 Build
[ 82%] Building CXX object Plugin-PrimitivesGenerator/CMakeFiles/Plugin-PrimitivesGenerator.dir/Plugin-PrimitivesGenerator_autogen/mocs_compilation.cpp.o
[ 82%] Linking CXX shared module ../Build/lib/plugins/libPlugin-PolyLine.so
[ 82%] Built target Plugin-PolyLine
[ 82%] Linking CXX shared module ../Build/lib/plugins/libPlugin-PrimitivesGenerator.so
[ 82%] Built target Plugin-PrimitivesGenerator
make: *** [Makefile:152: all] Error 2
Running after_script
Uploading artifacts for failed job
ERROR: Job failed: exit status 1
failed
Mac-Cpp11 Build
                           ^
3 errors generated.
make[2]: *** [OpenFlipper/CoreApp/CMakeFiles/OpenFlipper.dir/__/widgets/coreWidget/viewerControl.cc.o] Error 1
make[1]: *** [OpenFlipper/CoreApp/CMakeFiles/OpenFlipper.dir/all] Error 2
make[1]: *** Waiting for unfinished jobs....
[ 78%] Linking CXX shared module libPlugin-MeanCurvature.so
[ 78%] Built target Plugin-MeanCurvature
make: *** [all] Error 2
ERROR: Job failed: exit status 1
failed
debug-gcc-c++11-Qt5.11.2 Build
[ 78%] Linking CXX shared module ../../Build/lib/plugins/libPlugin-SelectionSplatCloudObject.so
[ 78%] Built target Plugin-TypePolyMesh
[ 78%] Built target Plugin-SelectionSplatCloudObject
[ 78%] Linking CXX shared module ../../Build/lib/plugins/libPlugin-SelectionVolumeMesh.so
[ 78%] Built target Plugin-SelectionVolumeMesh
make: *** [Makefile:152: all] Error 2
Running after_script
Uploading artifacts for failed job
ERROR: Job failed: exit status 1
failed
debug-gcc-c++11-Qt5.13.0 Build
[ 81%] Built target Plugin-TypePolyLineCollection
[ 81%] Linking CXX shared module ../../Build/lib/plugins/libPlugin-TypeSplatCloud.so
[ 81%] Linking CXX shared module ../Build/lib/plugins/libPlugin-AlignMeshes.so
[ 81%] Built target Plugin-TypeSplatCloud
[ 81%] Built target Plugin-AlignMeshes
make: *** [Makefile:152: all] Error 2
Running after_script
Uploading artifacts for failed job
ERROR: Job failed: exit status 1
failed
gcc-c++11-Qt5.13.0 Build
[ 83%] Built target Plugin-Decimater
[ 84%] Linking CXX shared module ../Build/lib/plugins/libPlugin-IsotropicRemesher.so
[ 84%] Built target Plugin-IsotropicRemesher
[ 84%] Linking CXX shared module ../Build/lib/plugins/libPlugin-Datacontrol.so
[ 84%] Built target Plugin-Datacontrol
make: *** [Makefile:152: all] Error 2
Running after_script
Uploading artifacts for failed job
ERROR: Job failed: exit status 1
failed
gcc-c++11-Qt5.11.2-nopython Build
[ 86%] Built target Plugin-AlignMeshes
[ 86%] Linking CXX shared module ../Build/lib/plugins/libPlugin-Decimater.so
[ 86%] Linking CXX shared module ../Build/lib/plugins/libPlugin-Datacontrol.so
[ 86%] Built target Plugin-Decimater
[ 86%] Built target Plugin-Datacontrol
make: *** [Makefile:152: all] Error 2
Running after_script
Uploading artifacts for failed job
ERROR: Job failed: exit status 1
failed
gcc-c++11-Qt5.11.2 Build
[ 85%] Linking CXX shared module ../../Build/lib/plugins/libPlugin-FileVTK.so
[ 85%] Built target Plugin-SelectionVolumeMesh
[ 85%] Built target Plugin-FileVTK
[ 85%] Linking CXX shared module ../../Build/lib/plugins/libPlugin-SelectionMeshObject.so
[ 85%] Built target Plugin-SelectionMeshObject
make: *** [Makefile:152: all] Error 2
Running after_script
Uploading artifacts for failed job
ERROR: Job failed: exit status 1
failed
gcc-c++11-Qt5.12.2-nopython Build
[ 83%] Built target Plugin-TypeCamera
[ 83%] Linking CXX shared module ../../Build/lib/plugins/libPlugin-SelectionSplatCloudObject.so
[ 83%] Built target Plugin-SelectionSplatCloudObject
[ 83%] Linking CXX shared module ../../Build/lib/plugins/libPlugin-SelectionVolumeMesh.so
[ 83%] Built target Plugin-SelectionVolumeMesh
make: *** [Makefile:152: all] Error 2
Running after_script
Uploading artifacts for failed job
ERROR: Job failed: exit status 1
failed
gcc-c++11-Qt5.12.2 Build
[ 84%] Built target Plugin-HoleFilling
[ 84%] Linking CXX shared module ../Build/lib/plugins/libPlugin-InfoMeshObject.so
[ 84%] Built target Plugin-InfoMeshObject
[ 84%] Linking CXX shared module ../Build/lib/plugins/libPlugin-Datacontrol.so
[ 84%] Built target Plugin-Datacontrol
make: *** [Makefile:152: all] Error 2
Running after_script
Uploading artifacts for failed job
ERROR: Job failed: exit status 1