Feature int histograms in PropertyVis

30 jobs for master in 42 minutes and 24 seconds (queued for 2 seconds)
Status Job ID Name Coverage
  Build
failed #100247
qt5113 Apple
Mac-Cpp11

00:07:13

passed #100245
Qt5141 VS2015
VS2015-Qt-5.14.1-x64

00:15:15

passed #100246
Qt5141 VS2017
VS2017-Qt-5.14.1

00:11:14

passed #100241
MultiThreads stretch Linux
clang-c++11-Qt5.11.2

00:11:24

passed #100242
MultiThreads stretch Linux
clang-c++11-Qt5.13.0

00:11:57

passed #100244
MultiThreads stretch Linux
cppcheck

00:01:15

passed #100243
MultiThreads stretch Linux
debug-clang-c++11-Qt5.13.0

00:11:42

passed #100240
stretch Linux
debug-gcc-c++11-Qt5.11.2

00:07:19

passed #100239
stretch Linux
debug-gcc-c++11-Qt5.13.0

00:09:01

passed #100236
stretch Linux
gcc-c++11-Qt5.11.2

00:06:48

passed #100237
stretch Linux
gcc-c++11-Qt5.11.2-nopython

00:05:07

passed #100234
stretch Linux
gcc-c++11-Qt5.12.2

00:06:49

passed #100235
stretch Linux
gcc-c++11-Qt5.12.2-nopython

00:06:10

passed #100238
stretch Linux
gcc-c++11-Qt5.13.0

00:06:56

 
  Test
skipped #100258
qt5113 Apple
Test:Mac-Cpp11
passed #100256
Qt5141 VS2015
Test:VS2015-Qt-5.14.1-x64

00:01:12

passed #100257
Qt5141 VS2017
Test:VS2017-Qt-5.14.1

00:02:46

passed #100255
MultiThreads stretch Linux
debug-test-clang-c++11-Qt5.13.0

00:05:28

passed #100252
stretch Linux
debug-test-gcc-c++11-Qt5.11.2

00:06:12

passed #100251
stretch Linux
debug-test-gcc-c++11-Qt5.13.0

00:05:50

passed #100253
MultiThreads stretch Linux
test-clang-c++11-Qt5.11.2

00:01:22

passed #100254
MultiThreads stretch Linux
test-clang-c++11-Qt5.13.0

00:03:01

passed #100249
stretch Linux
test-gcc-c++11-Qt5.11.2

00:02:02

passed #100248
stretch Linux
test-gcc-c++11-Qt5.12.2

00:02:08

passed #100250
stretch Linux
test-gcc-c++11-Qt5.13.0

00:02:23

 
  Deploy
skipped #100261
qt5113 Apple
Deploy:Mac-Cpp11
passed #100259
Qt5141 VS2015
Deploy:VS2015-Qt-5.14.1-x64

00:03:42

passed #100260
Qt5141 VS2017
Deploy:VS2017-Qt-5.14.1

00:15:42

skipped #100262
stretch Linux
Doc-publish
skipped #100263
stretch Linux
Sources
 
Name Stage Failure
failed
Mac-Cpp11 Build
/Users/jenkins/builds/8dfb9a4a/0/OpenFlipper-Free/OpenFlipper-Free/OpenFlipper/libs_required/ACG/QtWidgets/QtClippingDialog.hh:60:10: fatal error: 'ui_QtClippingDialogUi.h' file not found
#include "ui_QtClippingDialogUi.h"
^
1 error generated.
make[2]: *** [OpenFlipper/libs_required/ACG/CMakeFiles/ACG.dir/QtWidgets/QtClippingDialog.cc.o] Error 1
make[2]: *** Waiting for unfinished jobs....
make[1]: *** [OpenFlipper/libs_required/ACG/CMakeFiles/ACG.dir/all] Error 2
make: *** [all] Error 2
ERROR: Job failed: exit status 1