Use last material for new groups in OBJ Files

25 jobs for test-mac-ci in 73 minutes and 53 seconds (queued for 3 seconds)
latest
Status Job ID Name Coverage
  Build
failed #99293
qt5113 Apple
Mac-Cpp11

00:06:57

passed #99291
Qt5141 VS2015
VS2015-Qt-5.14.1-x64

00:14:47

passed #99292
Qt5141 VS2017
VS2017-Qt-5.14.1

00:16:10

passed #99287
MultiThreads stretch Linux
clang-c++11-Qt5.11.2

00:11:28

passed #99288
MultiThreads stretch Linux
clang-c++11-Qt5.13.0

00:11:45

passed #99290
MultiThreads stretch Linux
cppcheck

00:01:14

passed #99289
MultiThreads stretch Linux
debug-clang-c++11-Qt5.13.0

00:11:28

passed #99286
stretch Linux
debug-gcc-c++11-Qt5.11.2

00:09:22

passed #99285
stretch Linux
debug-gcc-c++11-Qt5.13.0

00:09:26

passed #99282
stretch Linux
gcc-c++11-Qt5.11.2

00:11:24

passed #99283
stretch Linux
gcc-c++11-Qt5.11.2-nopython

00:06:47

passed #99280
stretch Linux
gcc-c++11-Qt5.12.2

00:11:21

passed #99281
stretch Linux
gcc-c++11-Qt5.12.2-nopython

00:07:55

passed #99284
stretch Linux
gcc-c++11-Qt5.13.0

00:07:14

 
  Test
skipped #99304
qt5113 Apple
Test:Mac-Cpp11
passed #99302
Qt5141 VS2015
Test:VS2015-Qt-5.14.1-x64

00:01:17

passed #99303
Qt5141 VS2017
Test:VS2017-Qt-5.14.1

00:01:53

passed #99301
MultiThreads stretch Linux
debug-test-clang-c++11-Qt5.13.0

00:03:58

passed #99298
stretch Linux
debug-test-gcc-c++11-Qt5.11.2

00:05:59

passed #99297
stretch Linux
debug-test-gcc-c++11-Qt5.13.0

00:05:35

passed #99299
MultiThreads stretch Linux
test-clang-c++11-Qt5.11.2

00:01:26

passed #99300
MultiThreads stretch Linux
test-clang-c++11-Qt5.13.0

00:01:14

passed #99295
stretch Linux
test-gcc-c++11-Qt5.11.2

00:01:01

passed #99294
stretch Linux
test-gcc-c++11-Qt5.12.2

00:01:36

passed #99296
stretch Linux
test-gcc-c++11-Qt5.13.0

00:01:38

 
Name Stage Failure
failed
Mac-Cpp11 Build
/Users/jenkins/builds/8dfb9a4a/0/OpenFlipper-Free/OpenFlipper-Free/OpenFlipper/libs_required/ACG/QtWidgets/QtClippingDialog.hh:60:10: fatal error: 'ui_QtClippingDialogUi.h' file not found
#include "ui_QtClippingDialogUi.h"
^
1 error generated.
make[2]: *** [OpenFlipper/libs_required/ACG/CMakeFiles/ACG.dir/QtWidgets/QtClippingDialog.cc.o] Error 1
make[2]: *** Waiting for unfinished jobs....
make[1]: *** [OpenFlipper/libs_required/ACG/CMakeFiles/ACG.dir/all] Error 2
make: *** [all] Error 2
ERROR: Job failed: exit status 1