make_unique fix

25 jobs for mh-ci-propvis in 47 minutes and 43 seconds (queued for 2 seconds)
latest
Status Job ID Name Coverage
  Build
failed #99268
qt5113 Apple
Mac-Cpp11

00:07:02

passed #99266
Qt5141 VS2015
VS2015-Qt-5.14.1-x64

00:14:59

passed #99267
Qt5141 VS2017
VS2017-Qt-5.14.1

00:17:30

passed #99262
MultiThreads stretch Linux
clang-c++11-Qt5.11.2

00:11:31

passed #99263
MultiThreads stretch Linux
clang-c++11-Qt5.13.0

00:11:35

passed #99265
MultiThreads stretch Linux
cppcheck

00:01:20

passed #99264
MultiThreads stretch Linux
debug-clang-c++11-Qt5.13.0

00:11:27

passed #99261
stretch Linux
debug-gcc-c++11-Qt5.11.2

00:08:50

passed #99260
stretch Linux
debug-gcc-c++11-Qt5.13.0

00:14:01

passed #99257
stretch Linux
gcc-c++11-Qt5.11.2

00:06:48

passed #99258
stretch Linux
gcc-c++11-Qt5.11.2-nopython

00:07:01

passed #99255
stretch Linux
gcc-c++11-Qt5.12.2

00:11:38

passed #99256
stretch Linux
gcc-c++11-Qt5.12.2-nopython

00:07:02

passed #99259
stretch Linux
gcc-c++11-Qt5.13.0

00:07:19

 
  Test
skipped #99279
qt5113 Apple
Test:Mac-Cpp11
passed #99277
Qt5141 VS2015
Test:VS2015-Qt-5.14.1-x64

00:01:46

passed #99278
Qt5141 VS2017
Test:VS2017-Qt-5.14.1

00:02:37

passed #99276
MultiThreads stretch Linux
debug-test-clang-c++11-Qt5.13.0

00:06:06

passed #99273
stretch Linux
debug-test-gcc-c++11-Qt5.11.2

00:05:21

passed #99272
stretch Linux
debug-test-gcc-c++11-Qt5.13.0

00:04:40

passed #99274
MultiThreads stretch Linux
test-clang-c++11-Qt5.11.2

00:01:25

passed #99275
MultiThreads stretch Linux
test-clang-c++11-Qt5.13.0

00:01:16

passed #99270
stretch Linux
test-gcc-c++11-Qt5.11.2

00:01:41

passed #99269
stretch Linux
test-gcc-c++11-Qt5.12.2

00:01:54

passed #99271
stretch Linux
test-gcc-c++11-Qt5.13.0

00:02:20

 
Name Stage Failure
failed
Mac-Cpp11 Build
/Users/jenkins/builds/8dfb9a4a/0/OpenFlipper-Free/OpenFlipper-Free/OpenFlipper/libs_required/ACG/QtWidgets/QtClippingDialog.hh:60:10: fatal error: 'ui_QtClippingDialogUi.h' file not found
#include "ui_QtClippingDialogUi.h"
^
1 error generated.
make[2]: *** [OpenFlipper/libs_required/ACG/CMakeFiles/ACG.dir/QtWidgets/QtClippingDialog.cc.o] Error 1
make[2]: *** Waiting for unfinished jobs....
make[1]: *** [OpenFlipper/libs_required/ACG/CMakeFiles/ACG.dir/all] Error 2
make: *** [all] Error 2
ERROR: Job failed: exit status 1