Use HEXEX_EXPORT for the first time

6 jobs for cgg in 3 minutes and 12 seconds (queued for 6 minutes and 56 seconds)
Status Job ID Name Coverage
  Build
failed #82613
Linux
clang-c++11

00:02:50

failed #82615
Linux
clang-c++14

00:01:30

failed #82612
Linux
gcc-c++11

00:00:34

failed #82614
Linux
gcc-c++14

00:00:34

failed #82616
Apple
macos-c++11

00:00:05

failed #82617
Apple
macos-c++14

00:00:04

 
Name Stage Failure
failed
clang-c++11 Build
[  PASSED  ] 29 tests.
[ FAILED ] 4 tests, listed below:
[ FAILED ] CellExtraction.CellExtractionFiveAdvancedTest
[ FAILED ] CellExtraction.CellExtractionFiveFineTest
[ FAILED ] CellExtraction.CellExtractionSphereTest
[ FAILED ] CellExtraction.CellExtractionCylinderTest

4 FAILED TESTS
ERROR: Job failed: exit status 1
failed
clang-c++14 Build
[  PASSED  ] 29 tests.
[ FAILED ] 4 tests, listed below:
[ FAILED ] CellExtraction.CellExtractionFiveAdvancedTest
[ FAILED ] CellExtraction.CellExtractionFiveFineTest
[ FAILED ] CellExtraction.CellExtractionSphereTest
[ FAILED ] CellExtraction.CellExtractionCylinderTest

4 FAILED TESTS
ERROR: Job failed: exit status 1
failed
gcc-c++14 Build
[  PASSED  ] 29 tests.
[ FAILED ] 4 tests, listed below:
[ FAILED ] CellExtraction.CellExtractionFiveAdvancedTest
[ FAILED ] CellExtraction.CellExtractionFiveFineTest
[ FAILED ] CellExtraction.CellExtractionSphereTest
[ FAILED ] CellExtraction.CellExtractionCylinderTest

4 FAILED TESTS
ERROR: Job failed: exit status 1
failed
gcc-c++11 Build
[  PASSED  ] 29 tests.
[ FAILED ] 4 tests, listed below:
[ FAILED ] CellExtraction.CellExtractionFiveAdvancedTest
[ FAILED ] CellExtraction.CellExtractionFiveFineTest
[ FAILED ] CellExtraction.CellExtractionSphereTest
[ FAILED ] CellExtraction.CellExtractionCylinderTest

4 FAILED TESTS
ERROR: Job failed: exit status 1
failed
macos-c++14 Build
Call Stack (most recent call first):
/opt/local/share/cmake-3.14/Modules/FindPackageHandleStandardArgs.cmake:378 (_FPHSA_FAILURE_MESSAGE)
/opt/local/share/cmake-3.14/Modules/FindGTest.cmake:197 (FIND_PACKAGE_HANDLE_STANDARD_ARGS)
CMakeLists.txt:231 (find_package)


-- Configuring incomplete, errors occurred!
See also "/Users/jenkins/builds/b72f60fc/0/HexEx/libHexEx/build-release-cpp14/CMakeFiles/CMakeOutput.log".
ERROR: Job failed: exit status 1
failed
macos-c++11 Build
Call Stack (most recent call first):
/opt/local/share/cmake-3.14/Modules/FindPackageHandleStandardArgs.cmake:378 (_FPHSA_FAILURE_MESSAGE)
/opt/local/share/cmake-3.14/Modules/FindGTest.cmake:197 (FIND_PACKAGE_HANDLE_STANDARD_ARGS)
CMakeLists.txt:231 (find_package)


-- Configuring incomplete, errors occurred!
See also "/Users/jenkins/builds/b72f60fc/0/HexEx/libHexEx/build-release-cpp11/CMakeFiles/CMakeOutput.log".
ERROR: Job failed: exit status 1