wip

6 jobs for mh-experimental in 3 minutes and 40 seconds (queued for 1 second)
latest
Status Job ID Name Coverage
  Build
failed #80923
Linux
clang-c++11

00:03:40

failed #80925
Linux
clang-c++14

00:01:47

failed #80922
Linux
gcc-c++11

00:00:55

failed #80924
Linux
gcc-c++14

00:00:57

failed #80926
Apple
macos-c++11

00:01:31

failed #80927
Apple
macos-c++14

00:02:40

 
Name Stage Failure
failed
clang-c++11 Build
[==========] 33 tests from 5 test cases ran. (5836 ms total)
[ PASSED ] 30 tests.
[ FAILED ] 3 tests, listed below:
[ FAILED ] CellExtraction.CellExtractionFiveFineTest
[ FAILED ] CellExtraction.CellExtractionSphereTest
[ FAILED ] CellExtraction.CellExtractionCylinderTest

3 FAILED TESTS
ERROR: Job failed: exit status 1
failed
macos-c++14 Build
[==========] 33 tests from 5 test cases ran. (13142 ms total)
[ PASSED ] 30 tests.
[ FAILED ] 3 tests, listed below:
[ FAILED ] CellExtraction.CellExtractionFiveFineTest
[ FAILED ] CellExtraction.CellExtractionSphereTest
[ FAILED ] CellExtraction.CellExtractionCylinderTest

3 FAILED TESTS
ERROR: Job failed: exit status 1
failed
clang-c++14 Build
[==========] 33 tests from 5 test cases ran. (3583 ms total)
[ PASSED ] 30 tests.
[ FAILED ] 3 tests, listed below:
[ FAILED ] CellExtraction.CellExtractionFiveFineTest
[ FAILED ] CellExtraction.CellExtractionSphereTest
[ FAILED ] CellExtraction.CellExtractionCylinderTest

3 FAILED TESTS
ERROR: Job failed: exit status 1
failed
macos-c++11 Build
[==========] 33 tests from 5 test cases ran. (8641 ms total)
[ PASSED ] 30 tests.
[ FAILED ] 3 tests, listed below:
[ FAILED ] CellExtraction.CellExtractionFiveFineTest
[ FAILED ] CellExtraction.CellExtractionSphereTest
[ FAILED ] CellExtraction.CellExtractionCylinderTest

3 FAILED TESTS
ERROR: Job failed: exit status 1
failed
gcc-c++14 Build
[==========] 33 tests from 5 test cases ran. (6422 ms total)
[ PASSED ] 30 tests.
[ FAILED ] 3 tests, listed below:
[ FAILED ] CellExtraction.CellExtractionFiveFineTest
[ FAILED ] CellExtraction.CellExtractionSphereTest
[ FAILED ] CellExtraction.CellExtractionCylinderTest

3 FAILED TESTS
ERROR: Job failed: exit status 1
failed
gcc-c++11 Build
[==========] 33 tests from 5 test cases ran. (6793 ms total)
[ PASSED ] 30 tests.
[ FAILED ] 3 tests, listed below:
[ FAILED ] CellExtraction.CellExtractionFiveFineTest
[ FAILED ] CellExtraction.CellExtractionSphereTest
[ FAILED ] CellExtraction.CellExtractionCylinderTest

3 FAILED TESTS
ERROR: Job failed: exit status 1