fix inconsistencies in IPOPT finder

6 jobs for CMakeTargetDebugging in 6 minutes and 47 seconds
Status Job ID Name Coverage
  Test
failed #68315
Qt551 VS2013
CoMISo-VS2013-Qt-5.5.1-x64

00:00:13

failed #68316
IPOPT3129 VS2017
CoMISo-VS2017-Qt-5.10.1-x64

00:01:26

passed #68313
Linux
clang-c++11

00:05:12

passed #68312
Linux
gcc-c++11

00:06:47

failed #68314
Apple
macos-c++11

00:01:42

 
  Deploy
skipped #68317
trigger_build
 
Name Stage Failure
failed
CoMISo-VS2017-Qt-5.10.1-x64 Test
16>Done building project "small_quadratic_solver.vcxproj".
5> Creating library E:/gitlab/builds/9d73ae51/0/CoMISo/CoMISo/rel/Examples/small_AQP/Release/small_AQP.lib and object E:/gitlab/builds/9d73ae51/0/CoMISo/CoMISo/rel/Examples/small_AQP/Release/small_AQP.exp
5>small_AQP.vcxproj -> E:\gitlab\builds\9d73ae51\0\CoMISo\CoMISo\rel\Examples\small_AQP\Release\small_AQP.exe
5>Done building project "small_AQP.vcxproj".
18>------ Build started: Project: ALL_BUILD, Configuration: Release x64 ------
18>Building Custom Rule E:/gitlab/builds/9d73ae51/0/CoMISo/CoMISo/CMakeLists.txt
18>CMake does not need to re-run because E:/gitlab/builds/9d73ae51/0/CoMISo/CoMISo/rel/CMakeFiles/generate.stamp is up-to-date.
========== Build: 17 succeeded, 1 failed, 0 up-to-date, 0 skipped ==========
ERROR: Job failed: exit status 1
failed
macos-c++11 Test
[ 61%] Building CXX object CMakeFiles/CoMISo.dir/Utils/CoMISoError.cc.o
[ 62%] Building CXX object CMakeFiles/CoMISo.dir/QtWidgets/MISolverDialogUI.cc.o
[ 63%] Linking CXX shared library libCoMISo.dylib
ld: library not found for -lSuiteSparse
clang: error: linker command failed with exit code 1 (use -v to see invocation)
make[2]: *** [libCoMISo.dylib] Error 1
make[1]: *** [CMakeFiles/CoMISo.dir/all] Error 2
make: *** [all] Error 2
ERROR: Job failed: exit status 1
failed
CoMISo-VS2013-Qt-5.5.1-x64 Test
    "E:/libs/vs2013/x64/suitesparse-metis-for-windows-1.2.2-install/lib64" "E:/libs/vs2013/x64/suitesparse-metis-for-windows-1.2.2-install/lib64/lapack_blas_windows" "E:/libs/vs2013/x64/Ipopt-3.12.4/Ipopt/MSVisualStudio/v8-ifort/installed/lib"

Unknown arguments specified


-- Configuring incomplete, errors occurred!
See also "E:/gitlab/builds/1900f1de/0/CoMISo/CoMISo/rel/CMakeFiles/CMakeOutput.log".
See also "E:/gitlab/builds/1900f1de/0/CoMISo/CoMISo/rel/CMakeFiles/CMakeError.log".
ERROR: Job failed: exit status 1