find blas on Windows

6 jobs for Simplify_CMakeList in 7 minutes and 13 seconds (queued for 1 second)
Status Job ID Name Coverage
  Test
failed #58886
Qt551 VS2013
CoMISo-VS2013-Qt-5.5.1-x64

00:01:06

failed #58887
IPOPT3129 VS2017
CoMISo-VS2017-Qt-5.10.1-x64

00:00:26

passed #58884
Linux
clang-c++11

00:07:13

passed #58883
Linux
gcc-c++11

00:06:54

passed #58885
Apple
macos-c++11

00:02:44

 
  Deploy
skipped #58888
trigger_build
 
Name Stage Failure
failed
CoMISo-VS2017-Qt-5.10.1-x64 Test
		TargetDisplayName(optional)
/TfsLink Opens Team Explorer and launches a viewer for the
provided artifact URI if one is registered.
/useenv Use PATH, INCLUDE, LIBPATH, and LIB environment variables
instead of IDE paths for VC++ builds.

To attach the debugger from the command line, use:
VsJITDebugger.exe -p <pid>
ERROR: Job failed: exit status 1
failed
CoMISo-VS2013-Qt-5.5.1-x64 Test
9>LINK : fatal error LNK1181: cannot open input file '..\..\Release\CoMISo.lib'
15>LINK : fatal error LNK1181: cannot open input file '..\..\Release\CoMISo.lib'
17>LINK : fatal error LNK1181: cannot open input file '..\..\Release\CoMISo.lib'
5>LINK : fatal error LNK1181: cannot open input file '..\..\Release\CoMISo.lib'
18>------ Build started: Project: ALL_BUILD, Configuration: Release x64 ------
18> Building Custom Rule E:/gitlab/builds/1900f1de/0/CoMISo/CoMISo/CMakeLists.txt
18> CMake does not need to re-run because E:/gitlab/builds/1900f1de/0/CoMISo/CoMISo/rel/CMakeFiles/generate.stamp is up-to-date.
========== Build: 2 succeeded, 16 failed, 0 up-to-date, 0 skipped ==========
ERROR: Job failed: exit status 1